Build #6

Build: #6 failed Changes by Steven Blom

Build result summary

Details

Completed
Duration
53 seconds
Labels
None
Agent
Default Agent
Revision
acec394107590d545a3dffcec247fcba71bd89da acec394107590d545a3dffcec247fcba71bd89da
Fixed in
#7 (Changes by Steven Blom)

No failed tests found, a possible compilation error occurred.

Responsible

Code commits

Author Commit Message Commit date
Steven Blom Steven Blom acec394107590d545a3dffcec247fcba71bd89da acec394107590d545a3dffcec247fcba71bd89da Support Configurations and bug fixing
Steven Blom Steven Blom ecd5c73f21bbb74adc9b521427173ca67d5fe9ef ecd5c73f21bbb74adc9b521427173ca67d5fe9ef Rename rail transforms
Steven Blom Steven Blom 66d5ec6658d95cab5de46839df6a4e8dfafe57e6 66d5ec6658d95cab5de46839df6a4e8dfafe57e6 Add more rails
Steven Blom Steven Blom 595937a7b8b0ad5d17bbb041a20cc259f5ff7554 595937a7b8b0ad5d17bbb041a20cc259f5ff7554 Useful extensions to ItemStackHelper
Steven Blom Steven Blom 5623befd9d6c0a832b1a19cc6424f76c23b7c4ad 5623befd9d6c0a832b1a19cc6424f76c23b7c4ad Add start and stop for invisible blocks

Error summary for Default Job

The job generated some errors, drill down into the full build log for more details.

Java HotSpot(TM) 64-Bit Server VM warning: ignoring option MaxPermSize=256m; support was removed in 8.0
Java HotSpot(TM) 64-Bit Server VM warning: ignoring option MaxPermSize=256m; support was removed in 8.0
/var/atlassian/application-data/bamboo/xml-data/build-dir/SHEAR-REL-JOB1/build/sources/api/java/com/github/atomicblom/shearmadness/api/IVariationRegistry.java:5: error: package com.github.atomicblom.shearmadness.capability does not exist
import com.github.atomicblom.shearmadness.capability.ChiseledSheepCapability;
                                                    ^
/var/atlassian/application-data/bamboo/xml-data/build-dir/SHEAR-REL-JOB1/build/sources/api/java/com/github/atomicblom/shearmadness/api/behaviour/BehaviourBase.java:3: error: package com.github.atomicblom.shearmadness.capability does not exist
import com.github.atomicblom.shearmadness.capability.CapabilityProvider;
                                                    ^
/var/atlassian/application-data/bamboo/xml-data/build-dir/SHEAR-REL-JOB1/build/sources/api/java/com/github/atomicblom/shearmadness/api/behaviour/BehaviourBase.java:4: error: package com.github.atomicblom.shearmadness.capability does not exist
import com.github.atomicblom.shearmadness.capability.IChiseledSheepCapability;
                                                    ^
/var/atlassian/application-data/bamboo/xml-data/build-dir/SHEAR-REL-JOB1/build/sources/api/java/com/github/atomicblom/shearmadness/api/behaviour/BehaviourBase.java:13: error: cannot find symbol
    protected final IChiseledSheepCapability capability;
                    ^
  symbol:   class IChiseledSheepCapability
  location: class BehaviourBase<T>
  where T is a type-variable:
    T extends BehaviourBase declared in class BehaviourBase
/var/atlassian/application-data/bamboo/xml-data/build-dir/SHEAR-REL-JOB1/build/sources/api/java/com/github/atomicblom/shearmadness/api/behaviour/DamageBehaviour.java:3: error: package com.github.atomicblom.shearmadness.configuration does not exist
import com.github.atomicblom.shearmadness.configuration.Settings;
                                                       ^
/var/atlassian/application-data/bamboo/xml-data/build-dir/SHEAR-REL-JOB1/build/sources/api/java/com/github/atomicblom/shearmadness/api/behaviour/FlightBehaviour.java:4: error: package com.github.atomicblom.shearmadness.capability does not exist
import com.github.atomicblom.shearmadness.capability.ChiseledSheepCapability;
                                                    ^
/var/atlassian/application-data/bamboo/xml-data/build-dir/SHEAR-REL-JOB1/build/sources/api/java/com/github/atomicblom/shearmadness/api/behaviour/BehaviourBase.java:22: error: cannot find symbol
        this.capability = sheep.getCapability(CapabilityProvider.CHISELED_SHEEP, null);
                                              ^
  symbol:   variable CapabilityProvider
  location: class BehaviourBase<T>
  where T is a type-variable:
    T extends BehaviourBase declared in class BehaviourBase
Note: /var/atlassian/application-data/bamboo/xml-data/build-dir/SHEAR-REL-JOB1/build/sources/api/java/com/github/atomicblom/shearmadness/api/behaviour/ExplosiveBehaviour.java uses unchecked or unsafe operations.
Note: Recompile with -Xlint:unchecked for details.
7 errors

FAILURE: Build failed with an exception.

* What went wrong:
Execution failed for task ':compileApiJava'.
> Compilation failed; see the compiler error output for details.

* Try:
Run with --stacktrace option to get the stack trace. Run with --info or --debug option to get more log output.