Checks feature branches and keeps feature branches up to date

Build: #3 failed Changes by 3 people

Logs

The following logs have been generated by the jobs in this plan.
  • Expand all
  • Collapse all
Job Logs
Collapse Default Job Default Stage Download or View
01-Jul-2016 17:12:39 /var/atlassian/application-data/bamboo/xml-data/build-dir/SNS-BU-JOB1/build/sources/main/java/mod/steamnsteel/tileentity/structure/ShapeLITE.java:19: error: package com.foudroyantfactotum.tool.structure.IStructure.shape does not exist
01-Jul-2016 17:12:39 import com.foudroyantfactotum.tool.structure.IStructure.shape.IStructureShapeFluidHandler;
01-Jul-2016 17:12:39                                                              ^
01-Jul-2016 17:12:40 Note: Some input files use or override a deprecated API.
01-Jul-2016 17:12:40 Note: Recompile with -Xlint:deprecation for details.
01-Jul-2016 17:12:40 Note: Some messages have been simplified; recompile with -Xdiags:verbose to get full output
01-Jul-2016 17:12:40 100 errors
01-Jul-2016 17:12:40 :compileJava FAILED
01-Jul-2016 17:12:40 :compileJava (Thread[Daemon worker Thread 2,5,main]) completed. Took 1.843 secs.
01-Jul-2016 17:12:40
01-Jul-2016 17:12:40 FAILURE: Build failed with an exception.
01-Jul-2016 17:12:40
01-Jul-2016 17:12:40 * What went wrong:
01-Jul-2016 17:12:40 Execution failed for task ':compileJava'.
01-Jul-2016 17:12:40 > Compilation failed; see the compiler error output for details.
01-Jul-2016 17:12:40
01-Jul-2016 17:12:40
01-Jul-2016 17:12:40 BUILD FAILED
01-Jul-2016 17:12:40
01-Jul-2016 17:12:40 Total time: 4.396 secs
01-Jul-2016 17:12:40 * Try:
01-Jul-2016 17:12:40 Run with --stacktrace option to get the stack trace. Run with --debug option to get more log output.
01-Jul-2016 17:12:40 Stopped 0 compiler daemon(s).
01-Jul-2016 17:12:40 Received result Failure[value=org.gradle.initialization.ReportedException: org.gradle.internal.exceptions.LocationAwareException: Execution failed for task ':compileJava'.] from daemon DaemonInfo{pid=13990, address=[fd04d0d8-9ab6-4816-858e-29a800bd9650 port:36221, addresses:[/0:0:0:0:0:0:0:1%lo, /127.0.0.1]], idle=true, context=DefaultDaemonContext[uid=ea6619ca-4ffb-4f93-89a8-83348eb11324,javaHome=/usr/lib/jvm/oracle_jdk8,daemonRegistryDir=/home/bamboo/.gradle/daemon,pid=13990,idleTimeout=10800000,daemonOpts=-Xms512m,-Xmx2048m,-Dfile.encoding=UTF-8,-Duser.country=CA,-Duser.language=en,-Duser.variant]} (build should be done).
01-Jul-2016 17:12:40 Unable to publish artifact [universal]: