Checks feature branches and keeps feature branches up to date

Build: #3 failed

Job: Default Job failed

Stages & jobs

  1. Default Stage

Job result summary

Completed
Duration
41 seconds
Agent
Default Agent
Revision
79f8d83c8b58dc0c1c51c1e5dbabb4317421026f 79f8d83c8b58dc0c1c51c1e5dbabb4317421026f
Failing since
#1 (Rebuilt by Steven Blom)

No failed tests found, a possible compilation error occurred.

Error summary

The build generated some errors. See the full build log for more details.

Java HotSpot(TM) 64-Bit Server VM warning: ignoring option MaxPermSize=256m; support was removed in 8.0
/var/atlassian/application-data/bamboo/xml-data/build-dir/SNS-BU-JOB1/build/sources/main/java/mod/steamnsteel/tileentity/structure/BlastFurnaceTE.java:18: error: package com.foudroyantfactotum.tool.structure.IStructure.structure does not exist
import com.foudroyantfactotum.tool.structure.IStructure.structure.IStructureFluidHandler;
                                                                 ^
/var/atlassian/application-data/bamboo/xml-data/build-dir/SNS-BU-JOB1/build/sources/main/java/mod/steamnsteel/tileentity/structure/BlastFurnaceTE.java:19: error: package com.foudroyantfactotum.tool.structure.IStructure.structure does not exist
import com.foudroyantfactotum.tool.structure.IStructure.structure.IStructureSidedInventory;
                                                                 ^
/var/atlassian/application-data/bamboo/xml-data/build-dir/SNS-BU-JOB1/build/sources/main/java/mod/steamnsteel/tileentity/structure/BlastFurnaceTE.java:20: error: package com.foudroyantfactotum.tool.structure.coordinates does not exist
import com.foudroyantfactotum.tool.structure.coordinates.BlockPosUtil;
                                                        ^
/var/atlassian/application-data/bamboo/xml-data/build-dir/SNS-BU-JOB1/build/sources/main/java/mod/steamnsteel/tileentity/structure/BlastFurnaceTE.java:21: error: package com.foudroyantfactotum.tool.structure.registry does not exist
import com.foudroyantfactotum.tool.structure.registry.StructureDefinition;
                                                     ^
/var/atlassian/application-data/bamboo/xml-data/build-dir/SNS-BU-JOB1/build/sources/main/java/mod/steamnsteel/tileentity/structure/BlastFurnaceTE.java:33: error: package com.foudroyantfactotum.tool.structure.coordinates does not exist
import static com.foudroyantfactotum.tool.structure.coordinates.TransformLAG.*;
                                                               ^
/var/atlassian/application-data/bamboo/xml-data/build-dir/SNS-BU-JOB1/build/sources/main/java/mod/steamnsteel/tileentity/structure/BlastFurnaceTE.java:35: error: cannot find symbol
public class BlastFurnaceTE extends SteamNSteelStructureTE implements IStructureFluidHandler, IStructureSidedInventory
                                                                      ^
  symbol: class IStructureFluidHandler
/var/atlassian/application-data/bamboo/xml-data/build-dir/SNS-BU-JOB1/build/sources/main/java/mod/steamnsteel/tileentity/structure/BlastFurnaceTE.java:35: error: cannot find symbol
public class BlastFurnaceTE extends SteamNSteelStructureTE implements IStructureFluidHandler, IStructureSidedInventory
                                                                                              ^
  symbol: class IStructureSidedInventory
/var/atlassian/application-data/bamboo/xml-data/build-dir/SNS-BU-JOB1/build/sources/main/java/mod/steamnsteel/tileentity/structure/BlastFurnaceTE.java:70: error: cannot find symbol
    public BlastFurnaceTE(StructureDefinition sd, EnumFacing orientation, boolean mirror)
                          ^
  symbol:   class StructureDefinition
  location: class BlastFurnaceTE
/var/atlassian/application-data/bamboo/xml-data/build-dir/SNS-BU-JOB1/build/sources/main/java/mod/steamnsteel/tileentity/structure/BlastFurnaceTE.java:293: error: cannot find symbol
    protected void transformDirectionsOnLoad(StructureDefinition sd)
                                             ^
  symbol:   class StructureDefinition
  location: class BlastFurnaceTE
/var/atlassian/application-data/bamboo/xml-data/build-dir/SNS-BU-JOB1/build/sources/main/java/mod/steamnsteel/tileentity/structure/BallMillTE.java:18: error: package com.foudroyantfactotum.tool.structure.IStructure.structure does not exist
import com.foudroyantfactotum.tool.structure.IStructure.structure.IStructureFluidHandler;
                                                                 ^
/var/atlassian/application-data/bamboo/xml-data/build-dir/SNS-BU-JOB1/build/sources/main/java/mod/steamnsteel/tileentity/structure/BallMillTE.java:19: error: package com.foudroyantfactotum.tool.structure.IStructure.structure does not exist
import com.foudroyantfactotum.tool.structure.IStructure.structure.IStructureSidedInventory;
                                                                 ^
/var/atlassian/application-data/bamboo/xml-data/build-dir/SNS-BU-JOB1/build/sources/main/java/mod/steamnsteel/tileentity/structure/BallMillTE.java:20: error: package com.foudroyantfactotum.tool.structure.coordinates does not exist
import com.foudroyantfactotum.tool.structure.coordinates.BlockPosUtil;
                                                        ^
/var/atlassian/application-data/bamboo/xml-data/build-dir/SNS-BU-JOB1/build/sources/main/java/mod/steamnsteel/tileentity/structure/BallMillTE.java:21: error: package com.foudroyantfactotum.tool.structure.registry does not exist
import com.foudroyantfactotum.tool.structure.registry.StructureDefinition;
                                                     ^
/var/atlassian/application-data/bamboo/xml-data/build-dir/SNS-BU-JOB1/build/sources/main/java/mod/steamnsteel/tileentity/structure/BallMillTE.java:35: error: package com.foudroyantfactotum.tool.structure.coordinates does not exist
import static com.foudroyantfactotum.tool.structure.coordinates.TransformLAG.flagEnumFacing;
                                                               ^
/var/atlassian/application-data/bamboo/xml-data/build-dir/SNS-BU-JOB1/build/sources/main/java/mod/steamnsteel/tileentity/structure/BallMillTE.java:35: error: static import only from classes and interfaces
import static com.foudroyantfactotum.tool.structure.coordinates.TransformLAG.flagEnumFacing;
^
/var/atlassian/application-data/bamboo/xml-data/build-dir/SNS-BU-JOB1/build/sources/main/java/mod/steamnsteel/tileentity/structure/BallMillTE.java:36: error: package com.foudroyantfactotum.tool.structure.coordinates does not exist
import static com.foudroyantfactotum.tool.structure.coordinates.TransformLAG.localToGlobalDirection;
                                                               ^
/var/atlassian/application-data/bamboo/xml-data/build-dir/SNS-BU-JOB1/build/sources/main/java/mod/steamnsteel/tileentity/structure/BallMillTE.java:36: error: static import only from classes and interfaces
import static com.foudroyantfactotum.tool.structure.coordinates.TransformLAG.localToGlobalDirection;
^
/var/atlassian/application-data/bamboo/xml-data/build-dir/SNS-BU-JOB1/build/sources/main/java/mod/steamnsteel/tileentity/structure/BallMillTE.java:37: error: package com.foudroyantfactotum.tool.structure.coordinates does not exist
import static com.foudroyantfactotum.tool.structure.coordinates.TransformLAG.transformFromDefinitionToMaster;
                                                               ^
/var/atlassian/application-data/bamboo/xml-data/build-dir/SNS-BU-JOB1/build/sources/main/java/mod/steamnsteel/tileentity/structure/BallMillTE.java:37: error: static import only from classes and interfaces
import static com.foudroyantfactotum.tool.structure.coordinates.TransformLAG.transformFromDefinitionToMaster;
^
/var/atlassian/application-data/bamboo/xml-data/build-dir/SNS-BU-JOB1/build/sources/main/java/mod/steamnsteel/tileentity/structure/BallMillTE.java:39: error: cannot find symbol
public class BallMillTE extends SteamNSteelStructureTE implements IStructureSidedInventory, IStructureFluidHandler
                                                                  ^
  symbol: class IStructureSidedInventory
/var/atlassian/application-data/bamboo/xml-data/build-dir/SNS-BU-JOB1/build/sources/main/java/mod/steamnsteel/tileentity/structure/BallMillTE.java:39: error: cannot find symbol
public class BallMillTE extends SteamNSteelStructureTE implements IStructureSidedInventory, IStructureFluidHandler
                                                                                            ^
  symbol: class IStructureFluidHandler
/var/atlassian/application-data/bamboo/xml-data/build-dir/SNS-BU-JOB1/build/sources/main/java/mod/steamnsteel/tileentity/structure/BallMillTE.java:74: error: cannot find symbol
    public BallMillTE(StructureDefinition sd, EnumFacing orientation, boolean mirror)
                      ^
  symbol:   class StructureDefinition
  location: class BallMillTE
/var/atlassian/application-data/bamboo/xml-data/build-dir/SNS-BU-JOB1/build/sources/main/java/mod/steamnsteel/tileentity/structure/BallMillTE.java:297: error: cannot find symbol
    protected void transformDirectionsOnLoad(StructureDefinition sd)
                                             ^
  symbol:   class StructureDefinition
  location: class BallMillTE
/var/atlassian/application-data/bamboo/xml-data/build-dir/SNS-BU-JOB1/build/sources/main/java/mod/steamnsteel/tileentity/structure/ShapeLITE.java:18: error: package com.foudroyantfactotum.tool.structure.IStructure.shape does not exist
import com.foudroyantfactotum.tool.structure.IStructure.shape.IStructureShapeSidedInventory;
                                                             ^
/var/atlassian/application-data/bamboo/xml-data/build-dir/SNS-BU-JOB1/build/sources/main/java/mod/steamnsteel/tileentity/structure/ShapeLITE.java:19: error: package com.foudroyantfactotum.tool.structure.IStructure.shape does not exist
import com.foudroyantfactotum.tool.structure.IStructure.shape.IStructureShapeFluidHandler;
                                                             ^
Note: Some input files use or override a deprecated API.
Note: Recompile with -Xlint:deprecation for details.
Note: Some messages have been simplified; recompile with -Xdiags:verbose to get full output
100 errors

FAILURE: Build failed with an exception.

* What went wrong:
Execution failed for task ':compileJava'.
> Compilation failed; see the compiler error output for details.

* Try:
Run with --stacktrace option to get the stack trace. Run with --debug option to get more log output.