Checks feature branches and keeps feature branches up to date

Build: #3 failed

Job: Default Job failed

Stages & jobs

  1. Default Stage

Build log

The build generated 707 lines of output. Download or view full build log

01-Jul-2016 17:11:56 Build SteamNSteel - BranchUpdater - Default Job #3 (SNS-BU-JOB1-3) started building on agent Default Agent
01-Jul-2016 17:11:56
01-Jul-2016 17:11:57 Build working directory is /var/atlassian/application-data/bamboo/xml-data/build-dir/SNS-BU-JOB1
01-Jul-2016 17:11:57 Executing build SteamNSteel - BranchUpdater - Default Job #3 (SNS-BU-JOB1-3)
01-Jul-2016 17:11:57 Starting task 'Checkout Default Repository' of type 'com.atlassian.bamboo.plugins.vcs:task.vcs.checkout'
01-Jul-2016 17:11:57 Build always requires a clean checkout
01-Jul-2016 17:11:57 Cleaning build directory '/var/atlassian/application-data/bamboo/xml-data/build-dir/SNS-BU-JOB1'
01-Jul-2016 17:11:57 Updating source code to revision: 79f8d83c8b58dc0c1c51c1e5dbabb4317421026f
01-Jul-2016 17:11:57 Fetching 'refs/heads/develop' from 'https://github.com/SteamNSteel/SteamNSteel.git'.
01-Jul-2016 17:11:58 Checking out revision 79f8d83c8b58dc0c1c51c1e5dbabb4317421026f.
01-Jul-2016 17:11:58 Creating local git repository in '/var/atlassian/application-data/bamboo/xml-data/build-dir/SNS-BU-JOB1/.git'.
01-Jul-2016 17:11:58 Cloning into '/var/atlassian/application-data/bamboo/xml-data/build-dir/SNS-BU-JOB1'...
01-Jul-2016 17:11:59 Already on 'develop'
01-Jul-2016 17:11:59 Your branch is up-to-date with 'origin/develop'.
01-Jul-2016 17:11:59 Updated source code to revision: 79f8d83c8b58dc0c1c51c1e5dbabb4317421026f
01-Jul-2016 17:11:59 Finished task 'Checkout Default Repository' with result: Success
01-Jul-2016 17:11:59 Running pre-build action: Artifactory Release Staging
01-Jul-2016 17:11:59 Running pre-build action: VCS Version Collector
01-Jul-2016 17:11:59 Starting task 'setup IDE' of type 'org.swift.bamboo.groovy:gradlew'
01-Jul-2016 17:11:59
Beginning to execute external process for build 'SteamNSteel - BranchUpdater - Default Job #3 (SNS-BU-JOB1-3)'
... running command line:
/var/atlassian/application-data/bamboo/xml-data/build-dir/SNS-BU-JOB1/./gradlew --info setupDecompWorkspace idea
... in: /var/atlassian/application-data/bamboo/xml-data/build-dir/SNS-BU-JOB1
... using extra environment variables:
bamboo_planRepository_1_branch=develop
bamboo_repository_360450_previous_revision_number=619a4206c1bccd209e3dc600236013b61dcebaa0
bamboo_repository_360450_branch_name=develop
bamboo_repository_revision_number=79f8d83c8b58dc0c1c51c1e5dbabb4317421026f
bamboo_resultsUrl=http://builds.steamnsteel.info/browse/SNS-BU-JOB1-3
bamboo_planRepository_1_name=SteamNSteel Devel
bamboo_build_working_directory=/var/atlassian/application-data/bamboo/xml-data/build-dir/SNS-BU-JOB1
bamboo_buildKey=SNS-BU-JOB1
bamboo_shortPlanName=BranchUpdater
bamboo_repository_360450_name=SteamNSteel Devel
bamboo_planRepository_name=SteamNSteel Devel
bamboo_buildNumber=3
bamboo_shortJobName=Default Job
bamboo_buildResultsUrl=http://builds.steamnsteel.info/browse/SNS-BU-JOB1-3
bamboo_planRepository_repositoryUrl=https://github.com/SteamNSteel/SteamNSteel.git
bamboo_agentId=131073
bamboo_planName=SteamNSteel - BranchUpdater
bamboo_shortPlanKey=BU
bamboo_shortJobKey=JOB1
bamboo_repository_360450_git_branch=develop
bamboo_planRepository_revision=79f8d83c8b58dc0c1c51c1e5dbabb4317421026f
bamboo_repository_previous_revision_number=619a4206c1bccd209e3dc600236013b61dcebaa0
bamboo_buildTimeStamp=2016-07-01T17:11:56.648-07:00
bamboo_planRepository_previousRevision=619a4206c1bccd209e3dc600236013b61dcebaa0
bamboo_buildResultKey=SNS-BU-JOB1-3
bamboo_repository_git_branch=develop
bamboo_repository_branch_name=develop
bamboo_buildPlanName=SteamNSteel - BranchUpdater - Default Job
bamboo_planRepository_1_revision=79f8d83c8b58dc0c1c51c1e5dbabb4317421026f
bamboo_repository_name=SteamNSteel Devel
JAVA_HOME=/usr/lib/jvm/oracle_jdk8
bamboo_planRepository_branch=develop
bamboo_agentWorkingDirectory=/var/atlassian/application-data/bamboo/xml-data/build-dir
bamboo_capability_system_git_executable=/usr/bin/git
bamboo_planRepository_1_previousRevision=619a4206c1bccd209e3dc600236013b61dcebaa0
bamboo_repository_git_username=AtomicBlom
bamboo_repository_360450_git_repositoryUrl=https://github.com/SteamNSteel/SteamNSteel.git
bamboo_planRepository_1_type=gh
bamboo_planRepository_branchName=develop
bamboo_capability_system_jdk_JDK=/usr/lib/jvm/oracle_jdk8
bamboo_repository_360450_revision_number=79f8d83c8b58dc0c1c51c1e5dbabb4317421026f
bamboo_capability_system_jdk_JDK_1_8_0_65=/usr/lib/jvm/oracle_jdk8
bamboo_planRepository_type=gh
bamboo_planRepository_1_username=AtomicBlom
bamboo_repository_git_repositoryUrl=https://github.com/SteamNSteel/SteamNSteel.git
bamboo_capability_system_builder_gradlew_Local_Gradle=.
bamboo_working_directory=/var/atlassian/application-data/bamboo/xml-data/build-dir/SNS-BU-JOB1
bamboo_planKey=SNS-BU
bamboo_planRepository_1_repositoryUrl=https://github.com/SteamNSteel/SteamNSteel.git
bamboo_planRepository_username=AtomicBlom
bamboo_repository_360450_git_username=AtomicBlom
bamboo_capability_system_jdk_JDK_1_8=/usr/lib/jvm/oracle_jdk8
bamboo_planRepository_1_branchName=develop
PATH=/usr/lib/jvm/oracle_jdk8/bin:/usr/local/bin:/usr/bin:/bin:/usr/local/games:/usr/games
01-Jul-2016 17:11:59 Java HotSpot(TM) 64-Bit Server VM warning: ignoring option MaxPermSize=256m; support was removed in 8.0
01-Jul-2016 17:12:00 Connected to daemon DaemonInfo{pid=13990, address=[fd04d0d8-9ab6-4816-858e-29a800bd9650 port:36221, addresses:[/0:0:0:0:0:0:0:1%lo, /127.0.0.1]], idle=true, context=DefaultDaemonContext[uid=ea6619ca-4ffb-4f93-89a8-83348eb11324,javaHome=/usr/lib/jvm/oracle_jdk8,daemonRegistryDir=/home/bamboo/.gradle/daemon,pid=13990,idleTimeout=10800000,daemonOpts=-Xms512m,-Xmx2048m,-Dfile.encoding=UTF-8,-Duser.country=CA,-Duser.language=en,-Duser.variant]}. Dispatching request Build{id=c0d4c36e-be5b-4562-b0a2-ce4292d11dac.1, currentDir=/var/atlassian/application-data/bamboo/xml-data/build-dir/SNS-BU-JOB1}.
01-Jul-2016 17:12:00 Received result org.gradle.launcher.daemon.protocol.BuildStarted@183ec003 from daemon DaemonInfo{pid=13990, address=[fd04d0d8-9ab6-4816-858e-29a800bd9650 port:36221, addresses:[/0:0:0:0:0:0:0:1%lo, /127.0.0.1]], idle=true, context=DefaultDaemonContext[uid=ea6619ca-4ffb-4f93-89a8-83348eb11324,javaHome=/usr/lib/jvm/oracle_jdk8,daemonRegistryDir=/home/bamboo/.gradle/daemon,pid=13990,idleTimeout=10800000,daemonOpts=-Xms512m,-Xmx2048m,-Dfile.encoding=UTF-8,-Duser.country=CA,-Duser.language=en,-Duser.variant]} (build should be starting).
01-Jul-2016 17:12:00 The client will now receive all logging from the daemon (pid: 13990). The daemon log file: /home/bamboo/.gradle/daemon/2.7/daemon-13990.out.log
01-Jul-2016 17:12:00 Starting 2nd build in daemon [uptime: 2 mins 1.092 secs, performance: 99%, memory: 43% of 1.9 GB]
01-Jul-2016 17:12:00 Executing build with daemon context: DefaultDaemonContext[uid=ea6619ca-4ffb-4f93-89a8-83348eb11324,javaHome=/usr/lib/jvm/oracle_jdk8,daemonRegistryDir=/home/bamboo/.gradle/daemon,pid=13990,idleTimeout=10800000,daemonOpts=-Xms512m,-Xmx2048m,-Dfile.encoding=UTF-8,-Duser.country=CA,-Duser.language=en,-Duser.variant]
01-Jul-2016 17:12:00 Starting Build
01-Jul-2016 17:12:00 Settings evaluated using settings file '/master/settings.gradle'.
01-Jul-2016 17:12:00 Projects loaded. Root project using build file '/var/atlassian/application-data/bamboo/xml-data/build-dir/SNS-BU-JOB1/build.gradle'.
01-Jul-2016 17:12:00 Included projects: [root project 'SNS-BU-JOB1']
01-Jul-2016 17:12:00 Evaluating root project 'SNS-BU-JOB1' using build file '/var/atlassian/application-data/bamboo/xml-data/build-dir/SNS-BU-JOB1/build.gradle'.
01-Jul-2016 17:12:00 Compiling build file '/var/atlassian/application-data/bamboo/xml-data/build-dir/SNS-BU-JOB1/build.gradle' using SubsetScriptTransformer.
01-Jul-2016 17:12:00 Compiling build file '/var/atlassian/application-data/bamboo/xml-data/build-dir/SNS-BU-JOB1/build.gradle' using BuildScriptTransformer.
01-Jul-2016 17:12:02 This mapping 'snapshot_20160625' was designed for MC 1.9.4! Use at your own peril.
01-Jul-2016 17:12:02 Using McGUI from local path - You cannot produce a build with this configuration
01-Jul-2016 17:12:02 Using Structure from local path - You cannot produce a build with this configuration
01-Jul-2016 17:12:02 file or directory '/var/atlassian/application-data/bamboo/xml-data/build-dir/SNS-BU-JOB1/src/api/resources', not found
01-Jul-2016 17:12:02 All projects evaluated.
01-Jul-2016 17:12:02 Selected primary task 'setupDecompWorkspace' from project :
01-Jul-2016 17:12:02 Selected primary task 'idea' from project :
01-Jul-2016 17:12:02 Tasks to be executed: [task ':deobfCompileDummyTask', task ':deobfProvidedDummyTask', task ':getVersionJson', task ':extractUserdev', task ':extractDependencyATs', task ':extractMcpData', task ':extractMcpMappings', task ':genSrgs', task ':downloadClient', task ':downloadServer', task ':splitServerJar', task ':mergeJars', task ':deobfMcSRG', task ':decompileMc', task ':fixMcSources', task ':applySourcePatches', task ':remapMcSources', task ':recompileMc', task ':extractNatives', task ':getAssetIndex', task ':getAssets', task ':makeStart', task ':setupDecompWorkspace', task ':ideaModule', task ':ideaProject', task ':ideaWorkspace', task ':idea']
01-Jul-2016 17:12:02 :deobfCompileDummyTask (Thread[Daemon worker Thread 2,5,main]) started.
01-Jul-2016 17:12:02 :deobfCompileDummyTask
01-Jul-2016 17:12:02 Executing task ':deobfCompileDummyTask' (up-to-date check took 0.0 secs) due to:
01-Jul-2016 17:12:02   Task has not declared any outputs.
01-Jul-2016 17:12:02 :deobfCompileDummyTask (Thread[Daemon worker Thread 2,5,main]) completed. Took 0.003 secs.
01-Jul-2016 17:12:02 :deobfProvidedDummyTask (Thread[Daemon worker Thread 2,5,main]) started.
01-Jul-2016 17:12:02 :deobfProvidedDummyTask
01-Jul-2016 17:12:02 Executing task ':deobfProvidedDummyTask' (up-to-date check took 0.0 secs) due to:
01-Jul-2016 17:12:02   Task has not declared any outputs.
01-Jul-2016 17:12:02 :deobfProvidedDummyTask (Thread[Daemon worker Thread 2,5,main]) completed. Took 0.003 secs.
01-Jul-2016 17:12:02 :getVersionJson (Thread[Daemon worker Thread 2,5,main]) started.
01-Jul-2016 17:12:02 :getVersionJson
01-Jul-2016 17:12:02 Invalidating in-memory cache of /var/atlassian/application-data/bamboo/xml-data/build-dir/SNS-BU-JOB1/.gradle/2.7/taskArtifacts/fileSnapshots.bin
01-Jul-2016 17:12:02 Invalidating in-memory cache of /var/atlassian/application-data/bamboo/xml-data/build-dir/SNS-BU-JOB1/.gradle/2.7/taskArtifacts/fileHashes.bin
01-Jul-2016 17:12:02 Invalidating in-memory cache of /var/atlassian/application-data/bamboo/xml-data/build-dir/SNS-BU-JOB1/.gradle/2.7/taskArtifacts/outputFileStates.bin
01-Jul-2016 17:12:02 Invalidating in-memory cache of /var/atlassian/application-data/bamboo/xml-data/build-dir/SNS-BU-JOB1/.gradle/2.7/taskArtifacts/taskArtifacts.bin
01-Jul-2016 17:12:02 Executing task ':getVersionJson' (up-to-date check took 0.006 secs) due to:
01-Jul-2016 17:12:02   Task.upToDateWhen is false.
01-Jul-2016 17:12:02 :getVersionJson (Thread[Daemon worker Thread 2,5,main]) completed. Took 0.058 secs.
01-Jul-2016 17:12:02 :extractUserdev (Thread[Daemon worker Thread 2,5,main]) started.
01-Jul-2016 17:12:02 :extractUserdev
01-Jul-2016 17:12:02 Executing task ':extractUserdev' (up-to-date check took 0.085 secs) due to:
01-Jul-2016 17:12:02   No history is available.
01-Jul-2016 17:12:03 :extractUserdev (Thread[Daemon worker Thread 2,5,main]) completed. Took 0.228 secs.
01-Jul-2016 17:12:03 :extractDependencyATs (Thread[Daemon worker Thread 2,5,main]) started.
01-Jul-2016 17:12:03 :extractDependencyATs
01-Jul-2016 17:12:03 Skipping task ':extractDependencyATs' as task onlyIf is false.
01-Jul-2016 17:12:03 :extractDependencyATs SKIPPED
01-Jul-2016 17:12:03 :extractDependencyATs (Thread[Daemon worker Thread 2,5,main]) completed. Took 0.0 secs.
01-Jul-2016 17:12:03 :extractMcpData (Thread[Daemon worker Thread 2,5,main]) started.
01-Jul-2016 17:12:04 :extractMcpData
01-Jul-2016 17:12:04 Failed to get resource: GET. [HTTP HTTP/1.1 403 Forbidden: https://libraries.minecraft.net/de/oceanlabs/mcp/mcp/1.10.2/mcp-1.10.2.pom]
01-Jul-2016 17:12:04 Skipping task ':extractMcpData' as task onlyIf is false.
01-Jul-2016 17:12:04 :extractMcpData SKIPPED
01-Jul-2016 17:12:04 :extractMcpData (Thread[Daemon worker Thread 2,5,main]) completed. Took 1.284 secs.
01-Jul-2016 17:12:04 :extractMcpMappings (Thread[Daemon worker Thread 2,5,main]) started.
01-Jul-2016 17:12:05 :extractMcpMappings
01-Jul-2016 17:12:05 Failed to get resource: GET. [HTTP HTTP/1.1 403 Forbidden: https://libraries.minecraft.net/de/oceanlabs/mcp/mcp_snapshot/20160625-1.9.4/mcp_snapshot-20160625-1.9.4.pom]
01-Jul-2016 17:12:05 Skipping task ':extractMcpMappings' as task onlyIf is false.
01-Jul-2016 17:12:05 :extractMcpMappings SKIPPED
01-Jul-2016 17:12:05 :extractMcpMappings (Thread[Daemon worker Thread 2,5,main]) completed. Took 0.943 secs.
01-Jul-2016 17:12:05 :genSrgs (Thread[Daemon worker Thread 2,5,main]) started.
01-Jul-2016 17:12:05 :genSrgs
01-Jul-2016 17:12:05 Skipping task ':genSrgs' as task onlyIf is false.
01-Jul-2016 17:12:05 :genSrgs SKIPPED
01-Jul-2016 17:12:05 :genSrgs (Thread[Daemon worker Thread 2,5,main]) completed. Took 0.562 secs.
01-Jul-2016 17:12:05 :downloadClient (Thread[Daemon worker Thread 2,5,main]) started.
01-Jul-2016 17:12:06 :downloadClient
01-Jul-2016 17:12:06 Skipping task ':downloadClient' as task onlyIf is false.
01-Jul-2016 17:12:06 :downloadClient SKIPPED
01-Jul-2016 17:12:06 :downloadClient (Thread[Daemon worker Thread 2,5,main]) completed. Took 0.374 secs.
01-Jul-2016 17:12:06 :downloadServer (Thread[Daemon worker Thread 2,5,main]) started.
01-Jul-2016 17:12:06 :downloadServer
01-Jul-2016 17:12:06 Skipping task ':downloadServer' as task onlyIf is false.
01-Jul-2016 17:12:06 :downloadServer SKIPPED
01-Jul-2016 17:12:06 :downloadServer (Thread[Daemon worker Thread 2,5,main]) completed. Took 0.425 secs.
01-Jul-2016 17:12:06 :splitServerJar (Thread[Daemon worker Thread 2,5,main]) started.
01-Jul-2016 17:12:08 :splitServerJar
01-Jul-2016 17:12:08 Skipping task ':splitServerJar' as task onlyIf is false.
01-Jul-2016 17:12:08 :splitServerJar SKIPPED
01-Jul-2016 17:12:08 :splitServerJar (Thread[Daemon worker Thread 2,5,main]) completed. Took 2.078 secs.
01-Jul-2016 17:12:08 :mergeJars (Thread[Daemon worker Thread 2,5,main]) started.
01-Jul-2016 17:12:09 :mergeJars
01-Jul-2016 17:12:09 Skipping task ':mergeJars' as task onlyIf is false.
01-Jul-2016 17:12:09 :mergeJars SKIPPED
01-Jul-2016 17:12:09 :mergeJars (Thread[Daemon worker Thread 2,5,main]) completed. Took 1.171 secs.
01-Jul-2016 17:12:09 :deobfMcSRG (Thread[Daemon worker Thread 2,5,main]) started.
01-Jul-2016 17:12:10 :deobfMcSRG
01-Jul-2016 17:12:10 Skipping task ':deobfMcSRG' as task onlyIf is false.
01-Jul-2016 17:12:10 :deobfMcSRG SKIPPED
01-Jul-2016 17:12:10 :deobfMcSRG (Thread[Daemon worker Thread 2,5,main]) completed. Took 0.953 secs.
01-Jul-2016 17:12:10 :decompileMc (Thread[Daemon worker Thread 2,5,main]) started.
01-Jul-2016 17:12:11 :decompileMc
01-Jul-2016 17:12:11 Skipping task ':decompileMc' as task onlyIf is false.
01-Jul-2016 17:12:11 :decompileMc SKIPPED
01-Jul-2016 17:12:11 :decompileMc (Thread[Daemon worker Thread 2,5,main]) completed. Took 0.917 secs.
01-Jul-2016 17:12:11 :fixMcSources (Thread[Daemon worker Thread 2,5,main]) started.
01-Jul-2016 17:12:14 :fixMcSources
01-Jul-2016 17:12:14 Skipping task ':fixMcSources' as task onlyIf is false.
01-Jul-2016 17:12:14 :fixMcSources SKIPPED
01-Jul-2016 17:12:14 :fixMcSources (Thread[Daemon worker Thread 2,5,main]) completed. Took 2.275 secs.
01-Jul-2016 17:12:14 :applySourcePatches (Thread[Daemon worker Thread 2,5,main]) started.
01-Jul-2016 17:12:14 :applySourcePatches
01-Jul-2016 17:12:14 Skipping task ':applySourcePatches' as task onlyIf is false.
01-Jul-2016 17:12:14 :applySourcePatches SKIPPED
01-Jul-2016 17:12:14 :applySourcePatches (Thread[Daemon worker Thread 2,5,main]) completed. Took 0.877 secs.
01-Jul-2016 17:12:14 :remapMcSources (Thread[Daemon worker Thread 2,5,main]) started.
01-Jul-2016 17:12:15 :remapMcSources
01-Jul-2016 17:12:15 Skipping task ':remapMcSources' as task onlyIf is false.
01-Jul-2016 17:12:15 :remapMcSources SKIPPED
01-Jul-2016 17:12:15 :remapMcSources (Thread[Daemon worker Thread 2,5,main]) completed. Took 0.927 secs.
01-Jul-2016 17:12:15 :recompileMc (Thread[Daemon worker Thread 2,5,main]) started.
01-Jul-2016 17:12:16 :recompileMc
01-Jul-2016 17:12:16 Skipping task ':recompileMc' as task onlyIf is false.
01-Jul-2016 17:12:16 :recompileMc SKIPPED
01-Jul-2016 17:12:16 :recompileMc (Thread[Daemon worker Thread 2,5,main]) completed. Took 0.992 secs.
01-Jul-2016 17:12:16 :extractNatives (Thread[Daemon worker Thread 2,5,main]) started.
01-Jul-2016 17:12:16 :extractNatives
01-Jul-2016 17:12:16 Skipping task ':extractNatives' as task onlyIf is false.
01-Jul-2016 17:12:16 :extractNatives SKIPPED
01-Jul-2016 17:12:16 :extractNatives (Thread[Daemon worker Thread 2,5,main]) completed. Took 0.103 secs.
01-Jul-2016 17:12:16 :getAssetIndex (Thread[Daemon worker Thread 2,5,main]) started.
01-Jul-2016 17:12:16 :getAssetIndex
01-Jul-2016 17:12:16 Executing task ':getAssetIndex' (up-to-date check took 0.0 secs) due to:
01-Jul-2016 17:12:16   Task.upToDateWhen is false.
01-Jul-2016 17:12:17 :getAssetIndex UP-TO-DATE
01-Jul-2016 17:12:17 :getAssetIndex (Thread[Daemon worker Thread 2,5,main]) completed. Took 0.137 secs.
01-Jul-2016 17:12:17 :getAssets (Thread[Daemon worker Thread 2,5,main]) started.
01-Jul-2016 17:12:17 :getAssets
01-Jul-2016 17:12:17 Executing task ':getAssets' (up-to-date check took 0.0 secs) due to:
01-Jul-2016 17:12:17   Task has not declared any outputs.
01-Jul-2016 17:12:18 Current status: 243/1110   21%
01-Jul-2016 17:12:19 Current status: 535/1110   48%
01-Jul-2016 17:12:20 Current status: 842/1110   75%
01-Jul-2016 17:12:21 Current status: 1109/1110   99%
01-Jul-2016 17:12:21 :getAssets (Thread[Daemon worker Thread 2,5,main]) completed. Took 4.047 secs.
01-Jul-2016 17:12:21 :makeStart (Thread[Daemon worker Thread 2,5,main]) started.
01-Jul-2016 17:12:21 :makeStart
01-Jul-2016 17:12:21 Skipping task ':makeStart' as task onlyIf is false.
01-Jul-2016 17:12:21 :makeStart SKIPPED
01-Jul-2016 17:12:21 :makeStart (Thread[Daemon worker Thread 2,5,main]) completed. Took 0.04 secs.
01-Jul-2016 17:12:21 :setupDecompWorkspace (Thread[Daemon worker Thread 2,5,main]) started.
01-Jul-2016 17:12:21 :setupDecompWorkspace
01-Jul-2016 17:12:21 Skipping task ':setupDecompWorkspace' as it has no actions.
01-Jul-2016 17:12:21 :setupDecompWorkspace (Thread[Daemon worker Thread 2,5,main]) completed. Took 0.004 secs.
01-Jul-2016 17:12:21 :ideaModule (Thread[Daemon worker Thread 2,5,main]) started.
01-Jul-2016 17:12:21 :ideaModule
01-Jul-2016 17:12:21 Executing task ':ideaModule' (up-to-date check took 0.0 secs) due to:
01-Jul-2016 17:12:21   Task.upToDateWhen is false.
01-Jul-2016 17:12:21 file or directory '/var/atlassian/application-data/bamboo/xml-data/build-dir/SNS-BU-JOB1/libs', not found
01-Jul-2016 17:12:21 file or directory '/var/atlassian/application-data/bamboo/xml-data/build-dir/SNS-BU-JOB1/libs', not found
01-Jul-2016 17:12:21 Failed to get resource: GET. [HTTP HTTP/1.1 403 Forbidden: https://libraries.minecraft.net/net/minecraftforge/forgeSrc/1.10.2-12.18.0.2005-1.10.0/forgeSrc-1.10.2-12.18.0.2005-1.10.0.pom]
01-Jul-2016 17:12:21 Failed to get resource: GET. [HTTP HTTP/1.1 403 Forbidden: https://libraries.minecraft.net/net/minecraftforge/forgeSrc/1.10.2-12.18.0.2005-1.10.0/forgeSrc-1.10.2-12.18.0.2005-1.10.0.pom]
01-Jul-2016 17:12:21 file or directory '/var/atlassian/application-data/bamboo/xml-data/build-dir/SNS-BU-JOB1/libs', not found
01-Jul-2016 17:12:23 Failed to get resource: HEAD. [HTTP HTTP/1.1 403 Forbidden: https://libraries.minecraft.net/com/mojang/netty/1.6/netty-1.6-javadoc.jar]
01-Jul-2016 17:12:23 Failed to get resource: HEAD. [HTTP HTTP/1.1 403 Forbidden: https://libraries.minecraft.net/oshi-project/oshi-core/1.1/oshi-core-1.1-javadoc.jar]
01-Jul-2016 17:12:24 Failed to get resource: HEAD. [HTTP HTTP/1.1 403 Forbidden: https://libraries.minecraft.net/com/ibm/icu/icu4j-core-mojang/51.2/icu4j-core-mojang-51.2-javadoc.jar]
01-Jul-2016 17:12:25 Failed to get resource: HEAD. [HTTP HTTP/1.1 403 Forbidden: https://libraries.minecraft.net/com/mojang/authlib/1.5.22/authlib-1.5.22-javadoc.jar]
01-Jul-2016 17:12:26 Failed to get resource: HEAD. [HTTP HTTP/1.1 403 Forbidden: https://libraries.minecraft.net/com/mojang/realms/1.9.3/realms-1.9.3-sources.jar]
01-Jul-2016 17:12:27 Failed to get resource: HEAD. [HTTP HTTP/1.1 403 Forbidden: https://libraries.minecraft.net/it/unimi/dsi/fastutil/7.0.12_mojang/fastutil-7.0.12_mojang-javadoc.jar]
01-Jul-2016 17:12:27 Failed to get resource: HEAD. [HTTP HTTP/1.1 403 Forbidden: https://libraries.minecraft.net/net/minecraft/launchwrapper/1.12/launchwrapper-1.12-javadoc.jar]
01-Jul-2016 17:12:28 Failed to get resource: HEAD. [HTTP HTTP/1.1 403 Forbidden: https://libraries.minecraft.net/lzma/lzma/0.0.1/lzma-0.0.1-sources.jar]
01-Jul-2016 17:12:29 Failed to get resource: HEAD. [HTTP HTTP/1.1 403 Forbidden: https://libraries.minecraft.net/com/paulscode/codecjorbis/20101023/codecjorbis-20101023-javadoc.jar]
01-Jul-2016 17:12:30 Failed to get resource: HEAD. [HTTP HTTP/1.1 403 Forbidden: https://libraries.minecraft.net/com/paulscode/codecwav/20101023/codecwav-20101023-javadoc.jar]
01-Jul-2016 17:12:31 Failed to get resource: HEAD. [HTTP HTTP/1.1 403 Forbidden: https://libraries.minecraft.net/com/paulscode/libraryjavasound/20101123/libraryjavasound-20101123-javadoc.jar]
01-Jul-2016 17:12:31 Failed to get resource: HEAD. [HTTP HTTP/1.1 403 Forbidden: https://libraries.minecraft.net/com/paulscode/librarylwjglopenal/20100824/librarylwjglopenal-20100824-javadoc.jar]
01-Jul-2016 17:12:32 Failed to get resource: HEAD. [HTTP HTTP/1.1 403 Forbidden: https://libraries.minecraft.net/com/paulscode/soundsystem/20120107/soundsystem-20120107-javadoc.jar]
01-Jul-2016 17:12:33 Failed to get resource: HEAD. [HTTP HTTP/1.1 403 Forbidden: https://libraries.minecraft.net/java3d/vecmath/1.5.2/vecmath-1.5.2-javadoc.jar]
01-Jul-2016 17:12:34 Failed to get resource: HEAD. [HTTP HTTP/1.1 403 Forbidden: https://libraries.minecraft.net/org/lwjgl/lwjgl/lwjgl-platform/2.9.4-nightly-20150209/lwjgl-platform-2.9.4-nightly-20150209-sources.jar]
01-Jul-2016 17:12:34 file or directory '/var/atlassian/application-data/bamboo/xml-data/build-dir/SNS-BU-JOB1/libs', not found
01-Jul-2016 17:12:34 :ideaModule (Thread[Daemon worker Thread 2,5,main]) completed. Took 13.328 secs.
01-Jul-2016 17:12:34 :ideaProject (Thread[Daemon worker Thread 2,5,main]) started.
01-Jul-2016 17:12:34 :ideaProject
01-Jul-2016 17:12:34 Executing task ':ideaProject' (up-to-date check took 0.001 secs) due to:
01-Jul-2016 17:12:34   Task.upToDateWhen is false.
01-Jul-2016 17:12:34 :ideaProject (Thread[Daemon worker Thread 2,5,main]) completed. Took 0.11 secs.
01-Jul-2016 17:12:34 :ideaWorkspace (Thread[Daemon worker Thread 2,5,main]) started.
01-Jul-2016 17:12:34 :ideaWorkspace
01-Jul-2016 17:12:34 Executing task ':ideaWorkspace' (up-to-date check took 0.001 secs) due to:
01-Jul-2016 17:12:34   Task.upToDateWhen is false.
01-Jul-2016 17:12:34 :ideaWorkspace (Thread[Daemon worker Thread 2,5,main]) completed. Took 0.33 secs.
01-Jul-2016 17:12:34 :idea (Thread[Daemon worker Thread 2,5,main]) started.
01-Jul-2016 17:12:34 :idea
01-Jul-2016 17:12:34 Skipping task ':idea' as it has no actions.
01-Jul-2016 17:12:34 :idea (Thread[Daemon worker Thread 2,5,main]) completed. Took 0.001 secs.
01-Jul-2016 17:12:34
01-Jul-2016 17:12:34 BUILD SUCCESSFUL
01-Jul-2016 17:12:34
01-Jul-2016 17:12:34 Total time: 35.751 secs
01-Jul-2016 17:12:34 Stopped 0 compiler daemon(s).
01-Jul-2016 17:12:35 Received result Success[value=null] from daemon DaemonInfo{pid=13990, address=[fd04d0d8-9ab6-4816-858e-29a800bd9650 port:36221, addresses:[/0:0:0:0:0:0:0:1%lo, /127.0.0.1]], idle=true, context=DefaultDaemonContext[uid=ea6619ca-4ffb-4f93-89a8-83348eb11324,javaHome=/usr/lib/jvm/oracle_jdk8,daemonRegistryDir=/home/bamboo/.gradle/daemon,pid=13990,idleTimeout=10800000,daemonOpts=-Xms512m,-Xmx2048m,-Dfile.encoding=UTF-8,-Duser.country=CA,-Duser.language=en,-Duser.variant]} (build should be done).
01-Jul-2016 17:12:35 Finished task 'setup IDE' with result: Success
01-Jul-2016 17:12:35 Starting task 'Gradle Wrapper' of type 'org.swift.bamboo.groovy:gradlew'
01-Jul-2016 17:12:35
Beginning to execute external process for build 'SteamNSteel - BranchUpdater - Default Job #3 (SNS-BU-JOB1-3)'
... running command line:
/var/atlassian/application-data/bamboo/xml-data/build-dir/SNS-BU-JOB1/./gradlew --info build
... in: /var/atlassian/application-data/bamboo/xml-data/build-dir/SNS-BU-JOB1
... using extra environment variables:
bamboo_planRepository_1_branch=develop
bamboo_repository_360450_previous_revision_number=619a4206c1bccd209e3dc600236013b61dcebaa0
bamboo_repository_360450_branch_name=develop
bamboo_repository_revision_number=79f8d83c8b58dc0c1c51c1e5dbabb4317421026f
bamboo_resultsUrl=http://builds.steamnsteel.info/browse/SNS-BU-JOB1-3
bamboo_planRepository_1_name=SteamNSteel Devel
bamboo_build_working_directory=/var/atlassian/application-data/bamboo/xml-data/build-dir/SNS-BU-JOB1
bamboo_buildKey=SNS-BU-JOB1
bamboo_shortPlanName=BranchUpdater
bamboo_repository_360450_name=SteamNSteel Devel
bamboo_planRepository_name=SteamNSteel Devel
bamboo_buildNumber=3
bamboo_shortJobName=Default Job
bamboo_buildResultsUrl=http://builds.steamnsteel.info/browse/SNS-BU-JOB1-3
bamboo_planRepository_repositoryUrl=https://github.com/SteamNSteel/SteamNSteel.git
bamboo_agentId=131073
bamboo_planName=SteamNSteel - BranchUpdater
bamboo_shortPlanKey=BU
bamboo_shortJobKey=JOB1
bamboo_repository_360450_git_branch=develop
bamboo_planRepository_revision=79f8d83c8b58dc0c1c51c1e5dbabb4317421026f
bamboo_repository_previous_revision_number=619a4206c1bccd209e3dc600236013b61dcebaa0
bamboo_buildTimeStamp=2016-07-01T17:11:56.648-07:00
bamboo_planRepository_previousRevision=619a4206c1bccd209e3dc600236013b61dcebaa0
bamboo_buildResultKey=SNS-BU-JOB1-3
bamboo_repository_git_branch=develop
bamboo_repository_branch_name=develop
bamboo_buildPlanName=SteamNSteel - BranchUpdater - Default Job
bamboo_planRepository_1_revision=79f8d83c8b58dc0c1c51c1e5dbabb4317421026f
bamboo_repository_name=SteamNSteel Devel
JAVA_HOME=/usr/lib/jvm/oracle_jdk8
bamboo_planRepository_branch=develop
bamboo_agentWorkingDirectory=/var/atlassian/application-data/bamboo/xml-data/build-dir
bamboo_capability_system_git_executable=/usr/bin/git
bamboo_planRepository_1_previousRevision=619a4206c1bccd209e3dc600236013b61dcebaa0
bamboo_repository_git_username=AtomicBlom
bamboo_repository_360450_git_repositoryUrl=https://github.com/SteamNSteel/SteamNSteel.git
bamboo_planRepository_1_type=gh
bamboo_planRepository_branchName=develop
bamboo_build_commandline_org_swift_bamboo_groovy_gradlew_3=/var/atlassian/application-data/bamboo/xml-data/build-dir/SNS-BU-JOB1/./gradlew --info setupDecompWorkspace idea
bamboo_capability_system_jdk_JDK=/usr/lib/jvm/oracle_jdk8
bamboo_repository_360450_revision_number=79f8d83c8b58dc0c1c51c1e5dbabb4317421026f
bamboo_capability_system_jdk_JDK_1_8_0_65=/usr/lib/jvm/oracle_jdk8
bamboo_planRepository_type=gh
bamboo_planRepository_1_username=AtomicBlom
bamboo_repository_git_repositoryUrl=https://github.com/SteamNSteel/SteamNSteel.git
bamboo_capability_system_builder_gradlew_Local_Gradle=.
bamboo_working_directory=/var/atlassian/application-data/bamboo/xml-data/build-dir/SNS-BU-JOB1
bamboo_planKey=SNS-BU
bamboo_planRepository_1_repositoryUrl=https://github.com/SteamNSteel/SteamNSteel.git
bamboo_planRepository_username=AtomicBlom
bamboo_repository_360450_git_username=AtomicBlom
bamboo_capability_system_jdk_JDK_1_8=/usr/lib/jvm/oracle_jdk8
bamboo_planRepository_1_branchName=develop
PATH=/usr/lib/jvm/oracle_jdk8/bin:/usr/local/bin:/usr/bin:/bin:/usr/local/games:/usr/games
01-Jul-2016 17:12:35 Java HotSpot(TM) 64-Bit Server VM warning: ignoring option MaxPermSize=256m; support was removed in 8.0
01-Jul-2016 17:12:36 Connected to daemon DaemonInfo{pid=13990, address=[fd04d0d8-9ab6-4816-858e-29a800bd9650 port:36221, addresses:[/0:0:0:0:0:0:0:1%lo, /127.0.0.1]], idle=true, context=DefaultDaemonContext[uid=ea6619ca-4ffb-4f93-89a8-83348eb11324,javaHome=/usr/lib/jvm/oracle_jdk8,daemonRegistryDir=/home/bamboo/.gradle/daemon,pid=13990,idleTimeout=10800000,daemonOpts=-Xms512m,-Xmx2048m,-Dfile.encoding=UTF-8,-Duser.country=CA,-Duser.language=en,-Duser.variant]}. Dispatching request Build{id=f1d6d56a-8cfe-4b33-9442-101f3a0273e9.1, currentDir=/var/atlassian/application-data/bamboo/xml-data/build-dir/SNS-BU-JOB1}.
01-Jul-2016 17:12:36 Received result org.gradle.launcher.daemon.protocol.BuildStarted@7d9d0818 from daemon DaemonInfo{pid=13990, address=[fd04d0d8-9ab6-4816-858e-29a800bd9650 port:36221, addresses:[/0:0:0:0:0:0:0:1%lo, /127.0.0.1]], idle=true, context=DefaultDaemonContext[uid=ea6619ca-4ffb-4f93-89a8-83348eb11324,javaHome=/usr/lib/jvm/oracle_jdk8,daemonRegistryDir=/home/bamboo/.gradle/daemon,pid=13990,idleTimeout=10800000,daemonOpts=-Xms512m,-Xmx2048m,-Dfile.encoding=UTF-8,-Duser.country=CA,-Duser.language=en,-Duser.variant]} (build should be starting).
01-Jul-2016 17:12:36 The client will now receive all logging from the daemon (pid: 13990). The daemon log file: /home/bamboo/.gradle/daemon/2.7/daemon-13990.out.log
01-Jul-2016 17:12:36 Starting 3rd build in daemon [uptime: 2 mins 37.682 secs, performance: 99%, memory: 53% of 1.9 GB]
01-Jul-2016 17:12:36 Executing build with daemon context: DefaultDaemonContext[uid=ea6619ca-4ffb-4f93-89a8-83348eb11324,javaHome=/usr/lib/jvm/oracle_jdk8,daemonRegistryDir=/home/bamboo/.gradle/daemon,pid=13990,idleTimeout=10800000,daemonOpts=-Xms512m,-Xmx2048m,-Dfile.encoding=UTF-8,-Duser.country=CA,-Duser.language=en,-Duser.variant]
01-Jul-2016 17:12:36 Starting Build
01-Jul-2016 17:12:36 Settings evaluated using settings file '/master/settings.gradle'.
01-Jul-2016 17:12:36 Projects loaded. Root project using build file '/var/atlassian/application-data/bamboo/xml-data/build-dir/SNS-BU-JOB1/build.gradle'.
01-Jul-2016 17:12:36 Included projects: [root project 'SNS-BU-JOB1']
01-Jul-2016 17:12:36 Evaluating root project 'SNS-BU-JOB1' using build file '/var/atlassian/application-data/bamboo/xml-data/build-dir/SNS-BU-JOB1/build.gradle'.
01-Jul-2016 17:12:37 This mapping 'snapshot_20160625' was designed for MC 1.9.4! Use at your own peril.
01-Jul-2016 17:12:37 Using McGUI from local path - You cannot produce a build with this configuration
01-Jul-2016 17:12:37 Using Structure from local path - You cannot produce a build with this configuration
01-Jul-2016 17:12:37 file or directory '/var/atlassian/application-data/bamboo/xml-data/build-dir/SNS-BU-JOB1/src/api/resources', not found
01-Jul-2016 17:12:37 All projects evaluated.
01-Jul-2016 17:12:37 Selected primary task 'build' from project :
01-Jul-2016 17:12:37 file or directory '/var/atlassian/application-data/bamboo/xml-data/build-dir/SNS-BU-JOB1/libs', not found
01-Jul-2016 17:12:37 Tasks to be executed: [task ':deobfCompileDummyTask', task ':deobfProvidedDummyTask', task ':sourceApiJava', task ':compileApiJava', task ':processApiResources', task ':apiClasses', task ':apiJar', task ':sourceMainJava', task ':compileJava', task ':processResources', task ':classes', task ':jar', task ':sourceTestJava', task ':compileTestJava', task ':processTestResources', task ':testClasses', task ':test', task ':extractMcpData', task ':extractMcpMappings', task ':getVersionJson', task ':extractUserdev', task ':genSrgs', task ':shadowJar', task ':reobfJar', task ':assemble', task ':check', task ':build']
01-Jul-2016 17:12:37 In-memory cache of /var/atlassian/application-data/bamboo/xml-data/build-dir/SNS-BU-JOB1/.gradle/2.7/taskArtifacts/fileHashes.bin: Size{15}, CacheStats{hitCount=0, missCount=0, loadSuccessCount=0, loadExceptionCount=0, totalLoadTime=0, evictionCount=0}
01-Jul-2016 17:12:37 In-memory cache of /var/atlassian/application-data/bamboo/xml-data/build-dir/SNS-BU-JOB1/.gradle/2.7/taskArtifacts/outputFileStates.bin: Size{6}, CacheStats{hitCount=0, missCount=0, loadSuccessCount=0, loadExceptionCount=0, totalLoadTime=0, evictionCount=0}
01-Jul-2016 17:12:37 In-memory cache of /var/atlassian/application-data/bamboo/xml-data/build-dir/SNS-BU-JOB1/.gradle/2.7/taskArtifacts/fileSnapshots.bin: Size{12}, CacheStats{hitCount=0, missCount=0, loadSuccessCount=0, loadExceptionCount=0, totalLoadTime=0, evictionCount=0}
01-Jul-2016 17:12:37 In-memory cache of /var/atlassian/application-data/bamboo/xml-data/build-dir/SNS-BU-JOB1/.gradle/2.7/taskArtifacts/taskArtifacts.bin: Size{6}, CacheStats{hitCount=0, missCount=0, loadSuccessCount=0, loadExceptionCount=0, totalLoadTime=0, evictionCount=0}
01-Jul-2016 17:12:37 :deobfCompileDummyTask (Thread[Daemon worker Thread 2,5,main]) started.
01-Jul-2016 17:12:37 :deobfCompileDummyTask
01-Jul-2016 17:12:37 Executing task ':deobfCompileDummyTask' (up-to-date check took 0.0 secs) due to:
01-Jul-2016 17:12:37   Task has not declared any outputs.
01-Jul-2016 17:12:37 :deobfCompileDummyTask (Thread[Daemon worker Thread 2,5,main]) completed. Took 0.001 secs.
01-Jul-2016 17:12:37 :deobfProvidedDummyTask (Thread[Daemon worker Thread 2,5,main]) started.
01-Jul-2016 17:12:37 :deobfProvidedDummyTask
01-Jul-2016 17:12:37 Executing task ':deobfProvidedDummyTask' (up-to-date check took 0.0 secs) due to:
01-Jul-2016 17:12:37   Task has not declared any outputs.
01-Jul-2016 17:12:37 :deobfProvidedDummyTask (Thread[Daemon worker Thread 2,5,main]) completed. Took 0.001 secs.
01-Jul-2016 17:12:37 :sourceApiJava (Thread[Daemon worker Thread 2,5,main]) started.
01-Jul-2016 17:12:37 :sourceApiJava
01-Jul-2016 17:12:37 Executing task ':sourceApiJava' (up-to-date check took 0.007 secs) due to:
01-Jul-2016 17:12:37   No history is available.
01-Jul-2016 17:12:37 :sourceApiJava (Thread[Daemon worker Thread 2,5,main]) completed. Took 0.02 secs.
01-Jul-2016 17:12:37 :compileApiJava (Thread[Daemon worker Thread 2,5,main]) started.
01-Jul-2016 17:12:37 :compileApiJava
01-Jul-2016 17:12:37 file or directory '/var/atlassian/application-data/bamboo/xml-data/build-dir/SNS-BU-JOB1/libs', not found
01-Jul-2016 17:12:37 Failed to get resource: GET. [HTTP HTTP/1.1 403 Forbidden: https://libraries.minecraft.net/net/minecraftforge/forgeSrc/1.10.2-12.18.0.2005-1.10.0/forgeSrc-1.10.2-12.18.0.2005-1.10.0.pom]
01-Jul-2016 17:12:37 Executing task ':compileApiJava' (up-to-date check took 0.743 secs) due to:
01-Jul-2016 17:12:37   No history is available.
01-Jul-2016 17:12:37 All input files are considered out-of-date for incremental task ':compileApiJava'.
01-Jul-2016 17:12:37 file or directory '/var/atlassian/application-data/bamboo/xml-data/build-dir/SNS-BU-JOB1/libs', not found
01-Jul-2016 17:12:37 Compiling with JDK Java compiler API.
01-Jul-2016 17:12:38 :compileApiJava (Thread[Daemon worker Thread 2,5,main]) completed. Took 0.888 secs.
01-Jul-2016 17:12:38 :processApiResources (Thread[Daemon worker Thread 2,5,main]) started.
01-Jul-2016 17:12:38 :processApiResources
01-Jul-2016 17:12:38 file or directory '/var/atlassian/application-data/bamboo/xml-data/build-dir/SNS-BU-JOB1/src/api/resources', not found
01-Jul-2016 17:12:38 Skipping task ':processApiResources' as it has no source files.
01-Jul-2016 17:12:38 :processApiResources UP-TO-DATE
01-Jul-2016 17:12:38 :processApiResources (Thread[Daemon worker Thread 2,5,main]) completed. Took 0.001 secs.
01-Jul-2016 17:12:38 :apiClasses (Thread[Daemon worker Thread 2,5,main]) started.
01-Jul-2016 17:12:38 :apiClasses
01-Jul-2016 17:12:38 Skipping task ':apiClasses' as it has no actions.
01-Jul-2016 17:12:38 :apiClasses (Thread[Daemon worker Thread 2,5,main]) completed. Took 0.001 secs.
01-Jul-2016 17:12:38 :apiJar (Thread[Daemon worker Thread 2,5,main]) started.
01-Jul-2016 17:12:38 :apiJar
01-Jul-2016 17:12:38 Executing task ':apiJar' (up-to-date check took 0.004 secs) due to:
01-Jul-2016 17:12:38   No history is available.
01-Jul-2016 17:12:38 :apiJar (Thread[Daemon worker Thread 2,5,main]) completed. Took 0.037 secs.
01-Jul-2016 17:12:38 :sourceMainJava (Thread[Daemon worker Thread 2,5,main]) started.
01-Jul-2016 17:12:38 :sourceMainJava
01-Jul-2016 17:12:38 Executing task ':sourceMainJava' (up-to-date check took 0.063 secs) due to:
01-Jul-2016 17:12:38   No history is available.
01-Jul-2016 17:12:38 :sourceMainJava (Thread[Daemon worker Thread 2,5,main]) completed. Took 0.298 secs.
01-Jul-2016 17:12:38 :compileJava (Thread[Daemon worker Thread 2,5,main]) started.
01-Jul-2016 17:12:38 :compileJava
01-Jul-2016 17:12:38 file or directory '/var/atlassian/application-data/bamboo/xml-data/build-dir/SNS-BU-JOB1/libs', not found
01-Jul-2016 17:12:38 Executing task ':compileJava' (up-to-date check took 0.032 secs) due to:
01-Jul-2016 17:12:38   No history is available.
01-Jul-2016 17:12:38 All input files are considered out-of-date for incremental task ':compileJava'.
01-Jul-2016 17:12:38 file or directory '/var/atlassian/application-data/bamboo/xml-data/build-dir/SNS-BU-JOB1/libs', not found
01-Jul-2016 17:12:38 Compiling with JDK Java compiler API.
01-Jul-2016 17:12:38 /var/atlassian/application-data/bamboo/xml-data/build-dir/SNS-BU-JOB1/build/sources/main/java/mod/steamnsteel/TheMod.java:19: error: package com.foudroyantfactotum.tool.structure does not exist
01-Jul-2016 17:12:38 import com.foudroyantfactotum.tool.structure.StructureRegistry;
01-Jul-2016 17:12:38                                             ^
01-Jul-2016 17:12:38 /var/atlassian/application-data/bamboo/xml-data/build-dir/SNS-BU-JOB1/build/sources/main/java/mod/steamnsteel/block/SteamNSteelStructureShapeBlock.java:18: error: package com.foudroyantfactotum.tool.structure.block does not exist
01-Jul-2016 17:12:38 import com.foudroyantfactotum.tool.structure.block.StructureShapeBlock;
01-Jul-2016 17:12:38                                                   ^
01-Jul-2016 17:12:38 /var/atlassian/application-data/bamboo/xml-data/build-dir/SNS-BU-JOB1/build/sources/main/java/mod/steamnsteel/block/SteamNSteelStructureBlock.java:18: error: package com.foudroyantfactotum.tool.structure.block does not exist
01-Jul-2016 17:12:38 import com.foudroyantfactotum.tool.structure.block.StructureBlock;
01-Jul-2016 17:12:38                                                   ^
01-Jul-2016 17:12:38 /var/atlassian/application-data/bamboo/xml-data/build-dir/SNS-BU-JOB1/build/sources/main/java/mod/steamnsteel/block/SteamNSteelStructureBlock.java:21: error: cannot find symbol
01-Jul-2016 17:12:38 public abstract class SteamNSteelStructureBlock extends StructureBlock
01-Jul-2016 17:12:38                                                         ^
01-Jul-2016 17:12:38   symbol: class StructureBlock
01-Jul-2016 17:12:38 /var/atlassian/application-data/bamboo/xml-data/build-dir/SNS-BU-JOB1/build/sources/main/java/mod/steamnsteel/block/SteamNSteelStructureShapeBlock.java:30: error: cannot find symbol
01-Jul-2016 17:12:38 public class SteamNSteelStructureShapeBlock extends StructureShapeBlock implements ITileEntityProvider
01-Jul-2016 17:12:38                                                     ^
01-Jul-2016 17:12:38   symbol: class StructureShapeBlock
01-Jul-2016 17:12:38 /var/atlassian/application-data/bamboo/xml-data/build-dir/SNS-BU-JOB1/build/sources/main/java/mod/steamnsteel/block/machine/structure/SSBlastFurnaceStructure.java:19: error: package com.foudroyantfactotum.tool.structure.coordinates does not exist
01-Jul-2016 17:12:38 import com.foudroyantfactotum.tool.structure.coordinates.BlockPosUtil;
01-Jul-2016 17:12:38                                                         ^
01-Jul-2016 17:12:38 /var/atlassian/application-data/bamboo/xml-data/build-dir/SNS-BU-JOB1/build/sources/main/java/mod/steamnsteel/block/machine/structure/SSBlastFurnaceStructure.java:20: error: package com.foudroyantfactotum.tool.structure.tileentity does not exist
01-Jul-2016 17:12:38 import com.foudroyantfactotum.tool.structure.tileentity.StructureTE;
01-Jul-2016 17:12:38                                                        ^
01-Jul-2016 17:12:38 /var/atlassian/application-data/bamboo/xml-data/build-dir/SNS-BU-JOB1/build/sources/main/java/mod/steamnsteel/block/machine/structure/SSBlastFurnaceStructure.java:21: error: package com.foudroyantfactotum.tool.structure.utility does not exist
01-Jul-2016 17:12:38 import com.foudroyantfactotum.tool.structure.utility.StructureDefinitionBuilder;
01-Jul-2016 17:12:38                                                     ^
01-Jul-2016 17:12:38 /var/atlassian/application-data/bamboo/xml-data/build-dir/SNS-BU-JOB1/build/sources/main/java/mod/steamnsteel/block/machine/structure/SSBlastFurnaceStructure.java:63: error: cannot find symbol
01-Jul-2016 17:12:38     public void spawnBreakParticle(World world, StructureTE te, BlockPos local, float sx, float sy, float sz)
01-Jul-2016 17:12:38                                                 ^
01-Jul-2016 17:12:38   symbol:   class StructureTE
01-Jul-2016 17:12:38   location: class SSBlastFurnaceStructure
01-Jul-2016 17:12:38 /var/atlassian/application-data/bamboo/xml-data/build-dir/SNS-BU-JOB1/build/sources/main/java/mod/steamnsteel/block/machine/structure/SSBlastFurnaceStructure.java:87: error: cannot find symbol
01-Jul-2016 17:12:38     public StructureDefinitionBuilder getStructureBuild()
01-Jul-2016 17:12:38            ^
01-Jul-2016 17:12:38   symbol:   class StructureDefinitionBuilder
01-Jul-2016 17:12:38   location: class SSBlastFurnaceStructure
01-Jul-2016 17:12:38 /var/atlassian/application-data/bamboo/xml-data/build-dir/SNS-BU-JOB1/build/sources/main/java/mod/steamnsteel/block/machine/structure/FanLargeStructure.java:19: error: package com.foudroyantfactotum.tool.structure.coordinates does not exist
01-Jul-2016 17:12:38 import com.foudroyantfactotum.tool.structure.coordinates.BlockPosUtil;
01-Jul-2016 17:12:38                                                         ^
01-Jul-2016 17:12:38 /var/atlassian/application-data/bamboo/xml-data/build-dir/SNS-BU-JOB1/build/sources/main/java/mod/steamnsteel/block/machine/structure/FanLargeStructure.java:20: error: package com.foudroyantfactotum.tool.structure.tileentity does not exist
01-Jul-2016 17:12:38 import com.foudroyantfactotum.tool.structure.tileentity.StructureTE;
01-Jul-2016 17:12:38                                                        ^
01-Jul-2016 17:12:38 /var/atlassian/application-data/bamboo/xml-data/build-dir/SNS-BU-JOB1/build/sources/main/java/mod/steamnsteel/block/machine/structure/FanLargeStructure.java:21: error: package com.foudroyantfactotum.tool.structure.utility does not exist
01-Jul-2016 17:12:38 import com.foudroyantfactotum.tool.structure.utility.StructureDefinitionBuilder;
01-Jul-2016 17:12:38                                                     ^
01-Jul-2016 17:12:38 /var/atlassian/application-data/bamboo/xml-data/build-dir/SNS-BU-JOB1/build/sources/main/java/mod/steamnsteel/block/machine/structure/FanLargeStructure.java:118: error: cannot find symbol
01-Jul-2016 17:12:38     public void spawnBreakParticle(World world, StructureTE te, BlockPos local, float sx, float sy, float sz)
01-Jul-2016 17:12:38                                                 ^
01-Jul-2016 17:12:38   symbol:   class StructureTE
01-Jul-2016 17:12:38   location: class FanLargeStructure
01-Jul-2016 17:12:38 /var/atlassian/application-data/bamboo/xml-data/build-dir/SNS-BU-JOB1/build/sources/main/java/mod/steamnsteel/block/machine/structure/FanLargeStructure.java:157: error: cannot find symbol
01-Jul-2016 17:12:38     public StructureDefinitionBuilder getStructureBuild()
01-Jul-2016 17:12:38            ^
01-Jul-2016 17:12:38   symbol:   class StructureDefinitionBuilder
01-Jul-2016 17:12:38   location: class FanLargeStructure
01-Jul-2016 17:12:38 /var/atlassian/application-data/bamboo/xml-data/build-dir/SNS-BU-JOB1/build/sources/main/java/mod/steamnsteel/block/machine/structure/SSBoilerStructure.java:18: error: package com.foudroyantfactotum.tool.structure.coordinates does not exist
01-Jul-2016 17:12:38 import com.foudroyantfactotum.tool.structure.coordinates.BlockPosUtil;
01-Jul-2016 17:12:38                                                         ^
01-Jul-2016 17:12:38 /var/atlassian/application-data/bamboo/xml-data/build-dir/SNS-BU-JOB1/build/sources/main/java/mod/steamnsteel/block/machine/structure/SSBoilerStructure.java:19: error: package com.foudroyantfactotum.tool.structure.tileentity does not exist
01-Jul-2016 17:12:38 import com.foudroyantfactotum.tool.structure.tileentity.StructureTE;
01-Jul-2016 17:12:38                                                        ^
01-Jul-2016 17:12:38 /var/atlassian/application-data/bamboo/xml-data/build-dir/SNS-BU-JOB1/build/sources/main/java/mod/steamnsteel/block/machine/structure/SSBoilerStructure.java:20: error: package com.foudroyantfactotum.tool.structure.utility does not exist
01-Jul-2016 17:12:38 import com.foudroyantfactotum.tool.structure.utility.StructureDefinitionBuilder;
01-Jul-2016 17:12:38                                                     ^
01-Jul-2016 17:12:38 /var/atlassian/application-data/bamboo/xml-data/build-dir/SNS-BU-JOB1/build/sources/main/java/mod/steamnsteel/block/machine/structure/SSBoilerStructure.java:55: error: cannot find symbol
01-Jul-2016 17:12:38     public void spawnBreakParticle(World world, StructureTE te, BlockPos local, float sx, float sy, float sz)
01-Jul-2016 17:12:38                                                 ^
01-Jul-2016 17:12:38   symbol:   class StructureTE
01-Jul-2016 17:12:38   location: class SSBoilerStructure
01-Jul-2016 17:12:38 /var/atlassian/application-data/bamboo/xml-data/build-dir/SNS-BU-JOB1/build/sources/main/java/mod/steamnsteel/block/machine/structure/SSBoilerStructure.java:80: error: cannot find symbol
01-Jul-2016 17:12:38     public StructureDefinitionBuilder getStructureBuild()
01-Jul-2016 17:12:38            ^
01-Jul-2016 17:12:38   symbol:   class StructureDefinitionBuilder
01-Jul-2016 17:12:38   location: class SSBoilerStructure
01-Jul-2016 17:12:38 /var/atlassian/application-data/bamboo/xml-data/build-dir/SNS-BU-JOB1/build/sources/main/java/mod/steamnsteel/block/machine/structure/SSBallMillStructure.java:18: error: package com.foudroyantfactotum.tool.structure.coordinates does not exist
01-Jul-2016 17:12:38 import com.foudroyantfactotum.tool.structure.coordinates.BlockPosUtil;
01-Jul-2016 17:12:38                                                         ^
01-Jul-2016 17:12:38 /var/atlassian/application-data/bamboo/xml-data/build-dir/SNS-BU-JOB1/build/sources/main/java/mod/steamnsteel/block/machine/structure/SSBallMillStructure.java:19: error: package com.foudroyantfactotum.tool.structure.tileentity does not exist
01-Jul-2016 17:12:38 import com.foudroyantfactotum.tool.structure.tileentity.StructureTE;
01-Jul-2016 17:12:38                                                        ^
01-Jul-2016 17:12:38 /var/atlassian/application-data/bamboo/xml-data/build-dir/SNS-BU-JOB1/build/sources/main/java/mod/steamnsteel/block/machine/structure/SSBallMillStructure.java:20: error: package com.foudroyantfactotum.tool.structure.utility does not exist
01-Jul-2016 17:12:38 import com.foudroyantfactotum.tool.structure.utility.StructureDefinitionBuilder;
01-Jul-2016 17:12:38                                                     ^
01-Jul-2016 17:12:38 /var/atlassian/application-data/bamboo/xml-data/build-dir/SNS-BU-JOB1/build/sources/main/java/mod/steamnsteel/block/machine/structure/SSBallMillStructure.java:70: error: cannot find symbol
01-Jul-2016 17:12:38     public void spawnBreakParticle(World world, StructureTE te, BlockPos local, float sx, float sy, float sz)
01-Jul-2016 17:12:38                                                 ^
01-Jul-2016 17:12:38   symbol:   class StructureTE
01-Jul-2016 17:12:38   location: class SSBallMillStructure
01-Jul-2016 17:12:38 /var/atlassian/application-data/bamboo/xml-data/build-dir/SNS-BU-JOB1/build/sources/main/java/mod/steamnsteel/block/machine/structure/SSBallMillStructure.java:97: error: cannot find symbol
01-Jul-2016 17:12:38     public StructureDefinitionBuilder getStructureBuild()
01-Jul-2016 17:12:38            ^
01-Jul-2016 17:12:38   symbol:   class StructureDefinitionBuilder
01-Jul-2016 17:12:38   location: class SSBallMillStructure
01-Jul-2016 17:12:38 /var/atlassian/application-data/bamboo/xml-data/build-dir/SNS-BU-JOB1/build/sources/main/java/mod/steamnsteel/networking/PacketBufferExtensions.java:3: error: package com.sun.istack.internal does not exist
01-Jul-2016 17:12:38 import com.sun.istack.internal.NotNull;
01-Jul-2016 17:12:38                               ^
01-Jul-2016 17:12:38 /var/atlassian/application-data/bamboo/xml-data/build-dir/SNS-BU-JOB1/build/sources/main/java/mod/steamnsteel/item/tool/StructureBuild.java:18: error: package com.foudroyantfactotum.tool.structure.item does not exist
01-Jul-2016 17:12:38 import com.foudroyantfactotum.tool.structure.item.StructureFormTool;
01-Jul-2016 17:12:38                                                  ^
01-Jul-2016 17:12:38 /var/atlassian/application-data/bamboo/xml-data/build-dir/SNS-BU-JOB1/build/sources/main/java/mod/steamnsteel/item/tool/StructureBuild.java:23: error: cannot find symbol
01-Jul-2016 17:12:38 public class StructureBuild extends StructureFormTool
01-Jul-2016 17:12:38                                     ^
01-Jul-2016 17:12:38   symbol: class StructureFormTool
01-Jul-2016 17:12:38 /var/atlassian/application-data/bamboo/xml-data/build-dir/SNS-BU-JOB1/build/sources/main/java/mod/steamnsteel/proxy/CommonNetworkProxy.java:3: error: package com.foudroyantfactotum.tool.structure.net does not exist
01-Jul-2016 17:12:38 import com.foudroyantfactotum.tool.structure.net.StructureNetwork;
01-Jul-2016 17:12:38                                                 ^
01-Jul-2016 17:12:38 /var/atlassian/application-data/bamboo/xml-data/build-dir/SNS-BU-JOB1/build/sources/main/java/mod/steamnsteel/proxy/ClientRenderProxy.java:19: error: package com.foudroyantfactotum.tool.structure.renderer does not exist
01-Jul-2016 17:12:38 import com.foudroyantfactotum.tool.structure.renderer.StructureTESR;
01-Jul-2016 17:12:38                                                      ^
01-Jul-2016 17:12:38 /var/atlassian/application-data/bamboo/xml-data/build-dir/SNS-BU-JOB1/build/sources/main/java/mod/steamnsteel/tileentity/structure/LargeFanTE.java:18: error: package com.foudroyantfactotum.tool.structure.registry does not exist
01-Jul-2016 17:12:38 import com.foudroyantfactotum.tool.structure.registry.StructureDefinition;
01-Jul-2016 17:12:38                                                      ^
01-Jul-2016 17:12:38 /var/atlassian/application-data/bamboo/xml-data/build-dir/SNS-BU-JOB1/build/sources/main/java/mod/steamnsteel/tileentity/structure/SteamNSteelStructureTE.java:18: error: package com.foudroyantfactotum.tool.structure.registry does not exist
01-Jul-2016 17:12:38 import com.foudroyantfactotum.tool.structure.registry.StructureDefinition;
01-Jul-2016 17:12:38                                                      ^
01-Jul-2016 17:12:38 /var/atlassian/application-data/bamboo/xml-data/build-dir/SNS-BU-JOB1/build/sources/main/java/mod/steamnsteel/tileentity/structure/SteamNSteelStructureTE.java:19: error: package com.foudroyantfactotum.tool.structure.tileentity does not exist
01-Jul-2016 17:12:38 import com.foudroyantfactotum.tool.structure.tileentity.StructureTE;
01-Jul-2016 17:12:38                                                        ^
01-Jul-2016 17:12:38 /var/atlassian/application-data/bamboo/xml-data/build-dir/SNS-BU-JOB1/build/sources/main/java/mod/steamnsteel/tileentity/structure/SteamNSteelStructureTE.java:22: error: cannot find symbol
01-Jul-2016 17:12:38 public abstract class SteamNSteelStructureTE extends StructureTE
01-Jul-2016 17:12:38                                                      ^
01-Jul-2016 17:12:38   symbol: class StructureTE
01-Jul-2016 17:12:38 /var/atlassian/application-data/bamboo/xml-data/build-dir/SNS-BU-JOB1/build/sources/main/java/mod/steamnsteel/tileentity/structure/LargeFanTE.java:27: error: cannot find symbol
01-Jul-2016 17:12:38     public LargeFanTE(StructureDefinition sd, EnumFacing orientation, boolean mirror)
01-Jul-2016 17:12:38                       ^
01-Jul-2016 17:12:38   symbol:   class StructureDefinition
01-Jul-2016 17:12:38   location: class LargeFanTE
01-Jul-2016 17:12:38 /var/atlassian/application-data/bamboo/xml-data/build-dir/SNS-BU-JOB1/build/sources/main/java/mod/steamnsteel/tileentity/structure/SteamNSteelStructureTE.java:29: error: cannot find symbol
01-Jul-2016 17:12:38     public SteamNSteelStructureTE(StructureDefinition sd, EnumFacing orientation, boolean mirror)
01-Jul-2016 17:12:38                                   ^
01-Jul-2016 17:12:38   symbol:   class StructureDefinition
01-Jul-2016 17:12:38   location: class SteamNSteelStructureTE
01-Jul-2016 17:12:38 /var/atlassian/application-data/bamboo/xml-data/build-dir/SNS-BU-JOB1/build/sources/main/java/mod/steamnsteel/client/gui/ProjectTableGui.java:10: error: package mod.steamnsteel.mcgui.client.gui does not exist
01-Jul-2016 17:12:38 import mod.steamnsteel.mcgui.client.gui.GuiRenderer;
01-Jul-2016 17:12:38                                        ^
01-Jul-2016 17:12:38 /var/atlassian/application-data/bamboo/xml-data/build-dir/SNS-BU-JOB1/build/sources/main/java/mod/steamnsteel/client/gui/ProjectTableGui.java:11: error: package mod.steamnsteel.mcgui.client.gui does not exist
01-Jul-2016 17:12:38 import mod.steamnsteel.mcgui.client.gui.GuiSubTexture;
01-Jul-2016 17:12:38                                        ^
01-Jul-2016 17:12:38 /var/atlassian/application-data/bamboo/xml-data/build-dir/SNS-BU-JOB1/build/sources/main/java/mod/steamnsteel/client/gui/ProjectTableGui.java:12: error: package mod.steamnsteel.mcgui.client.gui does not exist
01-Jul-2016 17:12:38 import mod.steamnsteel.mcgui.client.gui.GuiTexture;
01-Jul-2016 17:12:38                                        ^
01-Jul-2016 17:12:38 /var/atlassian/application-data/bamboo/xml-data/build-dir/SNS-BU-JOB1/build/sources/main/java/mod/steamnsteel/client/gui/ProjectTableGui.java:13: error: package mod.steamnsteel.mcgui.client.gui.controls does not exist
01-Jul-2016 17:12:38 import mod.steamnsteel.mcgui.client.gui.controls.ScrollPaneControl;
01-Jul-2016 17:12:38                                                 ^
01-Jul-2016 17:12:38 /var/atlassian/application-data/bamboo/xml-data/build-dir/SNS-BU-JOB1/build/sources/main/java/mod/steamnsteel/client/gui/ProjectTableGui.java:14: error: package mod.steamnsteel.mcgui.client.gui.controls does not exist
01-Jul-2016 17:12:38 import mod.steamnsteel.mcgui.client.gui.controls.ScrollbarControl;
01-Jul-2016 17:12:38                                                 ^
01-Jul-2016 17:12:38 /var/atlassian/application-data/bamboo/xml-data/build-dir/SNS-BU-JOB1/build/sources/main/java/mod/steamnsteel/client/gui/ProjectTableGui.java:15: error: package mod.steamnsteel.mcgui.client.gui.controls does not exist
01-Jul-2016 17:12:38 import mod.steamnsteel.mcgui.client.gui.controls.TexturedPaneControl;
01-Jul-2016 17:12:38                                                 ^
01-Jul-2016 17:12:38 /var/atlassian/application-data/bamboo/xml-data/build-dir/SNS-BU-JOB1/build/sources/main/java/mod/steamnsteel/client/gui/ProjectTableGui.java:16: error: package mod.steamnsteel.mcgui.client.gui.events does not exist
01-Jul-2016 17:12:38 import mod.steamnsteel.mcgui.client.gui.events.IItemMadeVisibleEventListener;
01-Jul-2016 17:12:38                                               ^
01-Jul-2016 17:12:38 /var/atlassian/application-data/bamboo/xml-data/build-dir/SNS-BU-JOB1/build/sources/main/java/mod/steamnsteel/client/gui/SteamNSteelGui.java:5: error: package mod.steamnsteel.mcgui.client.gui does not exist
01-Jul-2016 17:12:38 import mod.steamnsteel.mcgui.client.gui.McGUI;
01-Jul-2016 17:12:38                                        ^
01-Jul-2016 17:12:38 /var/atlassian/application-data/bamboo/xml-data/build-dir/SNS-BU-JOB1/build/sources/main/java/mod/steamnsteel/client/gui/SteamNSteelGui.java:9: error: cannot find symbol
01-Jul-2016 17:12:38 public abstract class SteamNSteelGui extends McGUI {
01-Jul-2016 17:12:38                                              ^
01-Jul-2016 17:12:38   symbol: class McGUI
01-Jul-2016 17:12:38 /var/atlassian/application-data/bamboo/xml-data/build-dir/SNS-BU-JOB1/build/sources/main/java/mod/steamnsteel/client/gui/ProjectTableGui.java:29: error: cannot find symbol
01-Jul-2016 17:12:38     private final GuiTexture guiTexture = new GuiTexture(getResourceLocation("SSCraftingTableGUI"), 384, 384);
01-Jul-2016 17:12:38                   ^
01-Jul-2016 17:12:38   symbol:   class GuiTexture
01-Jul-2016 17:12:38   location: class ProjectTableGui
01-Jul-2016 17:12:38 /var/atlassian/application-data/bamboo/xml-data/build-dir/SNS-BU-JOB1/build/sources/main/java/mod/steamnsteel/client/gui/ProjectTableGui.java:34: error: cannot find symbol
01-Jul-2016 17:12:38     private ScrollPaneControl recipeListGuiComponent = null;
01-Jul-2016 17:12:38             ^
01-Jul-2016 17:12:38   symbol:   class ScrollPaneControl
01-Jul-2016 17:12:38   location: class ProjectTableGui
01-Jul-2016 17:12:38 /var/atlassian/application-data/bamboo/xml-data/build-dir/SNS-BU-JOB1/build/sources/main/java/mod/steamnsteel/client/gui/ProjectTableGui.java:35: error: cannot find symbol
01-Jul-2016 17:12:38     private ScrollbarControl scrollbarGuiComponent = null;
01-Jul-2016 17:12:38             ^
01-Jul-2016 17:12:38   symbol:   class ScrollbarControl
01-Jul-2016 17:12:38   location: class ProjectTableGui
01-Jul-2016 17:12:38 /var/atlassian/application-data/bamboo/xml-data/build-dir/SNS-BU-JOB1/build/sources/main/java/mod/steamnsteel/client/gui/ProjectTableGui.java:36: error: cannot find symbol
01-Jul-2016 17:12:38     private GuiRenderer guiRenderer;
01-Jul-2016 17:12:38             ^
01-Jul-2016 17:12:38   symbol:   class GuiRenderer
01-Jul-2016 17:12:38   location: class ProjectTableGui
01-Jul-2016 17:12:38 /var/atlassian/application-data/bamboo/xml-data/build-dir/SNS-BU-JOB1/build/sources/main/java/mod/steamnsteel/client/gui/ProjectTableGui.java:224: error: cannot find symbol
01-Jul-2016 17:12:38     private class RecipeMadeVisibleEventListener implements IItemMadeVisibleEventListener<ProjectTableRecipeInstance, ProjectTableRecipeControl>
01-Jul-2016 17:12:38                                                             ^
01-Jul-2016 17:12:38   symbol:   class IItemMadeVisibleEventListener
01-Jul-2016 17:12:38   location: class ProjectTableGui
01-Jul-2016 17:12:38 /var/atlassian/application-data/bamboo/xml-data/build-dir/SNS-BU-JOB1/build/sources/main/java/mod/steamnsteel/client/gui/controls/ProjectTableRecipeControl.java:8: error: package mod.steamnsteel.mcgui.client.gui does not exist
01-Jul-2016 17:12:38 import mod.steamnsteel.mcgui.client.gui.GuiRenderer;
01-Jul-2016 17:12:38                                        ^
01-Jul-2016 17:12:38 /var/atlassian/application-data/bamboo/xml-data/build-dir/SNS-BU-JOB1/build/sources/main/java/mod/steamnsteel/client/gui/controls/ProjectTableRecipeControl.java:9: error: package mod.steamnsteel.mcgui.client.gui does not exist
01-Jul-2016 17:12:38 import mod.steamnsteel.mcgui.client.gui.GuiTexture;
01-Jul-2016 17:12:38                                        ^
01-Jul-2016 17:12:38 /var/atlassian/application-data/bamboo/xml-data/build-dir/SNS-BU-JOB1/build/sources/main/java/mod/steamnsteel/client/gui/controls/ProjectTableRecipeControl.java:10: error: package mod.steamnsteel.mcgui.client.gui does not exist
01-Jul-2016 17:12:38 import mod.steamnsteel.mcgui.client.gui.IGuiTemplate;
01-Jul-2016 17:12:38                                        ^
01-Jul-2016 17:12:38 /var/atlassian/application-data/bamboo/xml-data/build-dir/SNS-BU-JOB1/build/sources/main/java/mod/steamnsteel/client/gui/controls/ProjectTableRecipeControl.java:11: error: package mod.steamnsteel.mcgui.client.gui does not exist
01-Jul-2016 17:12:38 import mod.steamnsteel.mcgui.client.gui.IModelView;
01-Jul-2016 17:12:38                                        ^
01-Jul-2016 17:12:38 /var/atlassian/application-data/bamboo/xml-data/build-dir/SNS-BU-JOB1/build/sources/main/java/mod/steamnsteel/client/gui/controls/ProjectTableRecipeControl.java:12: error: package mod.steamnsteel.mcgui.client.gui.controls does not exist
01-Jul-2016 17:12:38 import mod.steamnsteel.mcgui.client.gui.controls.ButtonControl;
01-Jul-2016 17:12:38                                                 ^
01-Jul-2016 17:12:38 /var/atlassian/application-data/bamboo/xml-data/build-dir/SNS-BU-JOB1/build/sources/main/java/mod/steamnsteel/client/gui/controls/ProjectTableRecipeControl.java:24: error: cannot find symbol
01-Jul-2016 17:12:38 public class ProjectTableRecipeControl extends ButtonControl implements IGuiTemplate<ProjectTableRecipeControl>, IModelView<ProjectTableRecipeInstance>
01-Jul-2016 17:12:38                                                ^
01-Jul-2016 17:12:38   symbol: class ButtonControl
01-Jul-2016 17:12:38 /var/atlassian/application-data/bamboo/xml-data/build-dir/SNS-BU-JOB1/build/sources/main/java/mod/steamnsteel/client/gui/controls/ProjectTableRecipeControl.java:24: error: cannot find symbol
01-Jul-2016 17:12:38 public class ProjectTableRecipeControl extends ButtonControl implements IGuiTemplate<ProjectTableRecipeControl>, IModelView<ProjectTableRecipeInstance>
01-Jul-2016 17:12:38                                                                         ^
01-Jul-2016 17:12:38   symbol: class IGuiTemplate
01-Jul-2016 17:12:38 /var/atlassian/application-data/bamboo/xml-data/build-dir/SNS-BU-JOB1/build/sources/main/java/mod/steamnsteel/client/gui/controls/ProjectTableRecipeControl.java:24: error: cannot find symbol
01-Jul-2016 17:12:38 public class ProjectTableRecipeControl extends ButtonControl implements IGuiTemplate<ProjectTableRecipeControl>, IModelView<ProjectTableRecipeInstance>
01-Jul-2016 17:12:38                                                                                                                  ^
01-Jul-2016 17:12:38   symbol: class IModelView
01-Jul-2016 17:12:38 /var/atlassian/application-data/bamboo/xml-data/build-dir/SNS-BU-JOB1/build/sources/main/java/mod/steamnsteel/client/gui/ProjectTableGui.java:228: error: cannot find symbol
01-Jul-2016 17:12:38         public void onItemMadeVisible(ScrollPaneControl scrollPaneControl, ProjectTableRecipeControl projectTableRecipeControl, ProjectTableRecipeInstance projectTableRecipe)
01-Jul-2016 17:12:38                                       ^
01-Jul-2016 17:12:38   symbol:   class ScrollPaneControl
01-Jul-2016 17:12:38   location: class ProjectTableGui.RecipeMadeVisibleEventListener
01-Jul-2016 17:12:38 /var/atlassian/application-data/bamboo/xml-data/build-dir/SNS-BU-JOB1/build/sources/main/java/mod/steamnsteel/client/gui/controls/ProjectTableRecipeControl.java:26: error: cannot find symbol
01-Jul-2016 17:12:38     private final GuiTexture craftableTexture;
01-Jul-2016 17:12:38                   ^
01-Jul-2016 17:12:38   symbol:   class GuiTexture
01-Jul-2016 17:12:38   location: class ProjectTableRecipeControl
01-Jul-2016 17:12:38 /var/atlassian/application-data/bamboo/xml-data/build-dir/SNS-BU-JOB1/build/sources/main/java/mod/steamnsteel/client/gui/controls/ProjectTableRecipeControl.java:27: error: cannot find symbol
01-Jul-2016 17:12:38     private final GuiTexture uncraftableTexture;
01-Jul-2016 17:12:38                   ^
01-Jul-2016 17:12:38   symbol:   class GuiTexture
01-Jul-2016 17:12:38   location: class ProjectTableRecipeControl
01-Jul-2016 17:12:38 /var/atlassian/application-data/bamboo/xml-data/build-dir/SNS-BU-JOB1/build/sources/main/java/mod/steamnsteel/client/gui/controls/ProjectTableRecipeControl.java:30: error: cannot find symbol
01-Jul-2016 17:12:38     public ProjectTableRecipeControl(GuiRenderer guiRenderer, GuiTexture craftableTexture, GuiTexture uncraftableTexture)
01-Jul-2016 17:12:38                                      ^
01-Jul-2016 17:12:38   symbol:   class GuiRenderer
01-Jul-2016 17:12:38   location: class ProjectTableRecipeControl
01-Jul-2016 17:12:38 /var/atlassian/application-data/bamboo/xml-data/build-dir/SNS-BU-JOB1/build/sources/main/java/mod/steamnsteel/client/gui/controls/ProjectTableRecipeControl.java:30: error: cannot find symbol
01-Jul-2016 17:12:38     public ProjectTableRecipeControl(GuiRenderer guiRenderer, GuiTexture craftableTexture, GuiTexture uncraftableTexture)
01-Jul-2016 17:12:38                                                               ^
01-Jul-2016 17:12:38   symbol:   class GuiTexture
01-Jul-2016 17:12:38   location: class ProjectTableRecipeControl
01-Jul-2016 17:12:38 /var/atlassian/application-data/bamboo/xml-data/build-dir/SNS-BU-JOB1/build/sources/main/java/mod/steamnsteel/client/gui/controls/ProjectTableRecipeControl.java:30: error: cannot find symbol
01-Jul-2016 17:12:38     public ProjectTableRecipeControl(GuiRenderer guiRenderer, GuiTexture craftableTexture, GuiTexture uncraftableTexture)
01-Jul-2016 17:12:38                                                                                            ^
01-Jul-2016 17:12:38   symbol:   class GuiTexture
01-Jul-2016 17:12:38   location: class ProjectTableRecipeControl
01-Jul-2016 17:12:39 /var/atlassian/application-data/bamboo/xml-data/build-dir/SNS-BU-JOB1/build/sources/main/java/mod/steamnsteel/tileentity/structure/SteamNSteelStructureShapeTE.java:18: error: package com.foudroyantfactotum.tool.structure.tileentity does not exist
01-Jul-2016 17:12:39 import com.foudroyantfactotum.tool.structure.tileentity.StructureShapeTE;
01-Jul-2016 17:12:39                                                        ^
01-Jul-2016 17:12:39 /var/atlassian/application-data/bamboo/xml-data/build-dir/SNS-BU-JOB1/build/sources/main/java/mod/steamnsteel/tileentity/structure/SteamNSteelStructureShapeTE.java:20: error: cannot find symbol
01-Jul-2016 17:12:39 public class SteamNSteelStructureShapeTE extends StructureShapeTE
01-Jul-2016 17:12:39                                                  ^
01-Jul-2016 17:12:39   symbol: class StructureShapeTE
01-Jul-2016 17:12:39 /var/atlassian/application-data/bamboo/xml-data/build-dir/SNS-BU-JOB1/build/sources/main/java/mod/steamnsteel/tileentity/structure/BoilerTE.java:18: error: package com.foudroyantfactotum.tool.structure.IStructure.structure does not exist
01-Jul-2016 17:12:39 import com.foudroyantfactotum.tool.structure.IStructure.structure.IStructureFluidHandler;
01-Jul-2016 17:12:39                                                                  ^
01-Jul-2016 17:12:39 /var/atlassian/application-data/bamboo/xml-data/build-dir/SNS-BU-JOB1/build/sources/main/java/mod/steamnsteel/tileentity/structure/BoilerTE.java:19: error: package com.foudroyantfactotum.tool.structure.IStructure.structure does not exist
01-Jul-2016 17:12:39 import com.foudroyantfactotum.tool.structure.IStructure.structure.IStructureSidedInventory;
01-Jul-2016 17:12:39                                                                  ^
01-Jul-2016 17:12:39 /var/atlassian/application-data/bamboo/xml-data/build-dir/SNS-BU-JOB1/build/sources/main/java/mod/steamnsteel/tileentity/structure/BoilerTE.java:20: error: package com.foudroyantfactotum.tool.structure.coordinates does not exist
01-Jul-2016 17:12:39 import com.foudroyantfactotum.tool.structure.coordinates.BlockPosUtil;
01-Jul-2016 17:12:39                                                         ^
01-Jul-2016 17:12:39 /var/atlassian/application-data/bamboo/xml-data/build-dir/SNS-BU-JOB1/build/sources/main/java/mod/steamnsteel/tileentity/structure/BoilerTE.java:21: error: package com.foudroyantfactotum.tool.structure.registry does not exist
01-Jul-2016 17:12:39 import com.foudroyantfactotum.tool.structure.registry.StructureDefinition;
01-Jul-2016 17:12:39                                                      ^
01-Jul-2016 17:12:39 /var/atlassian/application-data/bamboo/xml-data/build-dir/SNS-BU-JOB1/build/sources/main/java/mod/steamnsteel/tileentity/structure/BoilerTE.java:33: error: package com.foudroyantfactotum.tool.structure.coordinates does not exist
01-Jul-2016 17:12:39 import static com.foudroyantfactotum.tool.structure.coordinates.TransformLAG.*;
01-Jul-2016 17:12:39                                                                ^
01-Jul-2016 17:12:39 /var/atlassian/application-data/bamboo/xml-data/build-dir/SNS-BU-JOB1/build/sources/main/java/mod/steamnsteel/tileentity/structure/BoilerTE.java:35: error: cannot find symbol
01-Jul-2016 17:12:39 public class BoilerTE extends SteamNSteelStructureTE implements IStructureFluidHandler, IStructureSidedInventory
01-Jul-2016 17:12:39                                                                 ^
01-Jul-2016 17:12:39   symbol: class IStructureFluidHandler
01-Jul-2016 17:12:39 /var/atlassian/application-data/bamboo/xml-data/build-dir/SNS-BU-JOB1/build/sources/main/java/mod/steamnsteel/tileentity/structure/BoilerTE.java:35: error: cannot find symbol
01-Jul-2016 17:12:39 public class BoilerTE extends SteamNSteelStructureTE implements IStructureFluidHandler, IStructureSidedInventory
01-Jul-2016 17:12:39                                                                                         ^
01-Jul-2016 17:12:39   symbol: class IStructureSidedInventory
01-Jul-2016 17:12:39 /var/atlassian/application-data/bamboo/xml-data/build-dir/SNS-BU-JOB1/build/sources/main/java/mod/steamnsteel/tileentity/structure/BoilerTE.java:65: error: cannot find symbol
01-Jul-2016 17:12:39     public BoilerTE(StructureDefinition sd, EnumFacing orientation, boolean mirror)
01-Jul-2016 17:12:39                     ^
01-Jul-2016 17:12:39   symbol:   class StructureDefinition
01-Jul-2016 17:12:39   location: class BoilerTE
01-Jul-2016 17:12:39 /var/atlassian/application-data/bamboo/xml-data/build-dir/SNS-BU-JOB1/build/sources/main/java/mod/steamnsteel/tileentity/structure/BoilerTE.java:289: error: cannot find symbol
01-Jul-2016 17:12:39     protected void transformDirectionsOnLoad(StructureDefinition sd)
01-Jul-2016 17:12:39                                              ^
01-Jul-2016 17:12:39   symbol:   class StructureDefinition
01-Jul-2016 17:12:39   location: class BoilerTE
01-Jul-2016 17:12:39 /var/atlassian/application-data/bamboo/xml-data/build-dir/SNS-BU-JOB1/build/sources/main/java/mod/steamnsteel/tileentity/structure/BlastFurnaceTE.java:18: error: package com.foudroyantfactotum.tool.structure.IStructure.structure does not exist
01-Jul-2016 17:12:39 import com.foudroyantfactotum.tool.structure.IStructure.structure.IStructureFluidHandler;
01-Jul-2016 17:12:39                                                                  ^
01-Jul-2016 17:12:39 /var/atlassian/application-data/bamboo/xml-data/build-dir/SNS-BU-JOB1/build/sources/main/java/mod/steamnsteel/tileentity/structure/BlastFurnaceTE.java:19: error: package com.foudroyantfactotum.tool.structure.IStructure.structure does not exist
01-Jul-2016 17:12:39 import com.foudroyantfactotum.tool.structure.IStructure.structure.IStructureSidedInventory;
01-Jul-2016 17:12:39                                                                  ^
01-Jul-2016 17:12:39 /var/atlassian/application-data/bamboo/xml-data/build-dir/SNS-BU-JOB1/build/sources/main/java/mod/steamnsteel/tileentity/structure/BlastFurnaceTE.java:20: error: package com.foudroyantfactotum.tool.structure.coordinates does not exist
01-Jul-2016 17:12:39 import com.foudroyantfactotum.tool.structure.coordinates.BlockPosUtil;
01-Jul-2016 17:12:39                                                         ^
01-Jul-2016 17:12:39 /var/atlassian/application-data/bamboo/xml-data/build-dir/SNS-BU-JOB1/build/sources/main/java/mod/steamnsteel/tileentity/structure/BlastFurnaceTE.java:21: error: package com.foudroyantfactotum.tool.structure.registry does not exist
01-Jul-2016 17:12:39 import com.foudroyantfactotum.tool.structure.registry.StructureDefinition;
01-Jul-2016 17:12:39                                                      ^
01-Jul-2016 17:12:39 /var/atlassian/application-data/bamboo/xml-data/build-dir/SNS-BU-JOB1/build/sources/main/java/mod/steamnsteel/tileentity/structure/BlastFurnaceTE.java:33: error: package com.foudroyantfactotum.tool.structure.coordinates does not exist
01-Jul-2016 17:12:39 import static com.foudroyantfactotum.tool.structure.coordinates.TransformLAG.*;
01-Jul-2016 17:12:39                                                                ^
01-Jul-2016 17:12:39 /var/atlassian/application-data/bamboo/xml-data/build-dir/SNS-BU-JOB1/build/sources/main/java/mod/steamnsteel/tileentity/structure/BlastFurnaceTE.java:35: error: cannot find symbol
01-Jul-2016 17:12:39 public class BlastFurnaceTE extends SteamNSteelStructureTE implements IStructureFluidHandler, IStructureSidedInventory
01-Jul-2016 17:12:39                                                                       ^
01-Jul-2016 17:12:39   symbol: class IStructureFluidHandler
01-Jul-2016 17:12:39 /var/atlassian/application-data/bamboo/xml-data/build-dir/SNS-BU-JOB1/build/sources/main/java/mod/steamnsteel/tileentity/structure/BlastFurnaceTE.java:35: error: cannot find symbol
01-Jul-2016 17:12:39 public class BlastFurnaceTE extends SteamNSteelStructureTE implements IStructureFluidHandler, IStructureSidedInventory
01-Jul-2016 17:12:39                                                                                               ^
01-Jul-2016 17:12:39   symbol: class IStructureSidedInventory
01-Jul-2016 17:12:39 /var/atlassian/application-data/bamboo/xml-data/build-dir/SNS-BU-JOB1/build/sources/main/java/mod/steamnsteel/tileentity/structure/BlastFurnaceTE.java:70: error: cannot find symbol
01-Jul-2016 17:12:39     public BlastFurnaceTE(StructureDefinition sd, EnumFacing orientation, boolean mirror)
01-Jul-2016 17:12:39                           ^
01-Jul-2016 17:12:39   symbol:   class StructureDefinition
01-Jul-2016 17:12:39   location: class BlastFurnaceTE
01-Jul-2016 17:12:39 /var/atlassian/application-data/bamboo/xml-data/build-dir/SNS-BU-JOB1/build/sources/main/java/mod/steamnsteel/tileentity/structure/BlastFurnaceTE.java:293: error: cannot find symbol
01-Jul-2016 17:12:39     protected void transformDirectionsOnLoad(StructureDefinition sd)
01-Jul-2016 17:12:39                                              ^
01-Jul-2016 17:12:39   symbol:   class StructureDefinition
01-Jul-2016 17:12:39   location: class BlastFurnaceTE
01-Jul-2016 17:12:39 /var/atlassian/application-data/bamboo/xml-data/build-dir/SNS-BU-JOB1/build/sources/main/java/mod/steamnsteel/tileentity/structure/BallMillTE.java:18: error: package com.foudroyantfactotum.tool.structure.IStructure.structure does not exist
01-Jul-2016 17:12:39 import com.foudroyantfactotum.tool.structure.IStructure.structure.IStructureFluidHandler;
01-Jul-2016 17:12:39                                                                  ^
01-Jul-2016 17:12:39 /var/atlassian/application-data/bamboo/xml-data/build-dir/SNS-BU-JOB1/build/sources/main/java/mod/steamnsteel/tileentity/structure/BallMillTE.java:19: error: package com.foudroyantfactotum.tool.structure.IStructure.structure does not exist
01-Jul-2016 17:12:39 import com.foudroyantfactotum.tool.structure.IStructure.structure.IStructureSidedInventory;
01-Jul-2016 17:12:39                                                                  ^
01-Jul-2016 17:12:39 /var/atlassian/application-data/bamboo/xml-data/build-dir/SNS-BU-JOB1/build/sources/main/java/mod/steamnsteel/tileentity/structure/BallMillTE.java:20: error: package com.foudroyantfactotum.tool.structure.coordinates does not exist
01-Jul-2016 17:12:39 import com.foudroyantfactotum.tool.structure.coordinates.BlockPosUtil;
01-Jul-2016 17:12:39                                                         ^
01-Jul-2016 17:12:39 /var/atlassian/application-data/bamboo/xml-data/build-dir/SNS-BU-JOB1/build/sources/main/java/mod/steamnsteel/tileentity/structure/BallMillTE.java:21: error: package com.foudroyantfactotum.tool.structure.registry does not exist
01-Jul-2016 17:12:39 import com.foudroyantfactotum.tool.structure.registry.StructureDefinition;
01-Jul-2016 17:12:39                                                      ^
01-Jul-2016 17:12:39 /var/atlassian/application-data/bamboo/xml-data/build-dir/SNS-BU-JOB1/build/sources/main/java/mod/steamnsteel/tileentity/structure/BallMillTE.java:35: error: package com.foudroyantfactotum.tool.structure.coordinates does not exist
01-Jul-2016 17:12:39 import static com.foudroyantfactotum.tool.structure.coordinates.TransformLAG.flagEnumFacing;
01-Jul-2016 17:12:39                                                                ^
01-Jul-2016 17:12:39 /var/atlassian/application-data/bamboo/xml-data/build-dir/SNS-BU-JOB1/build/sources/main/java/mod/steamnsteel/tileentity/structure/BallMillTE.java:35: error: static import only from classes and interfaces
01-Jul-2016 17:12:39 import static com.foudroyantfactotum.tool.structure.coordinates.TransformLAG.flagEnumFacing;
01-Jul-2016 17:12:39 ^
01-Jul-2016 17:12:39 /var/atlassian/application-data/bamboo/xml-data/build-dir/SNS-BU-JOB1/build/sources/main/java/mod/steamnsteel/tileentity/structure/BallMillTE.java:36: error: package com.foudroyantfactotum.tool.structure.coordinates does not exist
01-Jul-2016 17:12:39 import static com.foudroyantfactotum.tool.structure.coordinates.TransformLAG.localToGlobalDirection;
01-Jul-2016 17:12:39                                                                ^
01-Jul-2016 17:12:39 /var/atlassian/application-data/bamboo/xml-data/build-dir/SNS-BU-JOB1/build/sources/main/java/mod/steamnsteel/tileentity/structure/BallMillTE.java:36: error: static import only from classes and interfaces
01-Jul-2016 17:12:39 import static com.foudroyantfactotum.tool.structure.coordinates.TransformLAG.localToGlobalDirection;
01-Jul-2016 17:12:39 ^
01-Jul-2016 17:12:39 /var/atlassian/application-data/bamboo/xml-data/build-dir/SNS-BU-JOB1/build/sources/main/java/mod/steamnsteel/tileentity/structure/BallMillTE.java:37: error: package com.foudroyantfactotum.tool.structure.coordinates does not exist
01-Jul-2016 17:12:39 import static com.foudroyantfactotum.tool.structure.coordinates.TransformLAG.transformFromDefinitionToMaster;
01-Jul-2016 17:12:39                                                                ^
01-Jul-2016 17:12:39 /var/atlassian/application-data/bamboo/xml-data/build-dir/SNS-BU-JOB1/build/sources/main/java/mod/steamnsteel/tileentity/structure/BallMillTE.java:37: error: static import only from classes and interfaces
01-Jul-2016 17:12:39 import static com.foudroyantfactotum.tool.structure.coordinates.TransformLAG.transformFromDefinitionToMaster;
01-Jul-2016 17:12:39 ^
01-Jul-2016 17:12:39 /var/atlassian/application-data/bamboo/xml-data/build-dir/SNS-BU-JOB1/build/sources/main/java/mod/steamnsteel/tileentity/structure/BallMillTE.java:39: error: cannot find symbol
01-Jul-2016 17:12:39 public class BallMillTE extends SteamNSteelStructureTE implements IStructureSidedInventory, IStructureFluidHandler
01-Jul-2016 17:12:39                                                                   ^
01-Jul-2016 17:12:39   symbol: class IStructureSidedInventory
01-Jul-2016 17:12:39 /var/atlassian/application-data/bamboo/xml-data/build-dir/SNS-BU-JOB1/build/sources/main/java/mod/steamnsteel/tileentity/structure/BallMillTE.java:39: error: cannot find symbol
01-Jul-2016 17:12:39 public class BallMillTE extends SteamNSteelStructureTE implements IStructureSidedInventory, IStructureFluidHandler
01-Jul-2016 17:12:39                                                                                             ^
01-Jul-2016 17:12:39   symbol: class IStructureFluidHandler
01-Jul-2016 17:12:39 /var/atlassian/application-data/bamboo/xml-data/build-dir/SNS-BU-JOB1/build/sources/main/java/mod/steamnsteel/tileentity/structure/BallMillTE.java:74: error: cannot find symbol
01-Jul-2016 17:12:39     public BallMillTE(StructureDefinition sd, EnumFacing orientation, boolean mirror)
01-Jul-2016 17:12:39                       ^
01-Jul-2016 17:12:39   symbol:   class StructureDefinition
01-Jul-2016 17:12:39   location: class BallMillTE
01-Jul-2016 17:12:39 /var/atlassian/application-data/bamboo/xml-data/build-dir/SNS-BU-JOB1/build/sources/main/java/mod/steamnsteel/tileentity/structure/BallMillTE.java:297: error: cannot find symbol
01-Jul-2016 17:12:39     protected void transformDirectionsOnLoad(StructureDefinition sd)
01-Jul-2016 17:12:39                                              ^
01-Jul-2016 17:12:39   symbol:   class StructureDefinition
01-Jul-2016 17:12:39   location: class BallMillTE
01-Jul-2016 17:12:39 /var/atlassian/application-data/bamboo/xml-data/build-dir/SNS-BU-JOB1/build/sources/main/java/mod/steamnsteel/tileentity/structure/ShapeLITE.java:18: error: package com.foudroyantfactotum.tool.structure.IStructure.shape does not exist
01-Jul-2016 17:12:39 import com.foudroyantfactotum.tool.structure.IStructure.shape.IStructureShapeSidedInventory;
01-Jul-2016 17:12:39                                                              ^
01-Jul-2016 17:12:39 /var/atlassian/application-data/bamboo/xml-data/build-dir/SNS-BU-JOB1/build/sources/main/java/mod/steamnsteel/tileentity/structure/ShapeLITE.java:19: error: package com.foudroyantfactotum.tool.structure.IStructure.shape does not exist
01-Jul-2016 17:12:39 import com.foudroyantfactotum.tool.structure.IStructure.shape.IStructureShapeFluidHandler;
01-Jul-2016 17:12:39                                                              ^
01-Jul-2016 17:12:40 Note: Some input files use or override a deprecated API.
01-Jul-2016 17:12:40 Note: Recompile with -Xlint:deprecation for details.
01-Jul-2016 17:12:40 Note: Some messages have been simplified; recompile with -Xdiags:verbose to get full output
01-Jul-2016 17:12:40 100 errors
01-Jul-2016 17:12:40 :compileJava FAILED
01-Jul-2016 17:12:40 :compileJava (Thread[Daemon worker Thread 2,5,main]) completed. Took 1.843 secs.
01-Jul-2016 17:12:40
01-Jul-2016 17:12:40 FAILURE: Build failed with an exception.
01-Jul-2016 17:12:40
01-Jul-2016 17:12:40 * What went wrong:
01-Jul-2016 17:12:40 Execution failed for task ':compileJava'.
01-Jul-2016 17:12:40 > Compilation failed; see the compiler error output for details.
01-Jul-2016 17:12:40
01-Jul-2016 17:12:40
01-Jul-2016 17:12:40 BUILD FAILED
01-Jul-2016 17:12:40
01-Jul-2016 17:12:40 Total time: 4.396 secs
01-Jul-2016 17:12:40 * Try:
01-Jul-2016 17:12:40 Run with --stacktrace option to get the stack trace. Run with --debug option to get more log output.
01-Jul-2016 17:12:40 Stopped 0 compiler daemon(s).
01-Jul-2016 17:12:40 Received result Failure[value=org.gradle.initialization.ReportedException: org.gradle.internal.exceptions.LocationAwareException: Execution failed for task ':compileJava'.] from daemon DaemonInfo{pid=13990, address=[fd04d0d8-9ab6-4816-858e-29a800bd9650 port:36221, addresses:[/0:0:0:0:0:0:0:1%lo, /127.0.0.1]], idle=true, context=DefaultDaemonContext[uid=ea6619ca-4ffb-4f93-89a8-83348eb11324,javaHome=/usr/lib/jvm/oracle_jdk8,daemonRegistryDir=/home/bamboo/.gradle/daemon,pid=13990,idleTimeout=10800000,daemonOpts=-Xms512m,-Xmx2048m,-Dfile.encoding=UTF-8,-Duser.country=CA,-Duser.language=en,-Duser.variant]} (build should be done).
01-Jul-2016 17:12:40 Failing task since return code of [/var/atlassian/application-data/bamboo/xml-data/build-dir/SNS-BU-JOB1/./gradlew --info build] was 1 while expected 0
01-Jul-2016 17:12:40 Finished task 'Gradle Wrapper' with result: Failed
01-Jul-2016 17:12:40 Running post build plugin 'Artifactory Release Management Staging'
01-Jul-2016 17:12:40 Running post build plugin 'Artifactory Build Info Copier'
01-Jul-2016 17:12:40 Running post build plugin 'Artifactory Gradle Properties Info Copier'
01-Jul-2016 17:12:40 Running post build plugin 'npm Cache Cleanup'
01-Jul-2016 17:12:40 Running post build plugin 'NCover Results Collector'
01-Jul-2016 17:12:40 Running post build plugin 'Clover Results Collector'
01-Jul-2016 17:12:40 Running post build plugin 'Docker Container Cleanup'
01-Jul-2016 17:12:40 Running post build plugin 'Artifact Copier'
01-Jul-2016 17:12:40 Publishing an artifact: universal
01-Jul-2016 17:12:40 Unable to publish artifact [universal]:
01-Jul-2016 17:12:40 Finished publishing of artifact Job artifact: [universal], pattern: [*steamnsteel*-universal.jar] anchored at: [build/libs] in 0s
01-Jul-2016 17:12:40 Finalising the build...
01-Jul-2016 17:12:40 Stopping timer.
01-Jul-2016 17:12:40 Build SNS-BU-JOB1-3 completed.
01-Jul-2016 17:12:40 Running on server: post build plugin 'NCover Results Collector'
01-Jul-2016 17:12:40 Running on server: post build plugin 'Clover Delta Calculator'
01-Jul-2016 17:12:40 Running on server: post build plugin 'Maven Dependencies Postprocessor'
01-Jul-2016 17:12:40 Running on server: post build plugin 'Build Hanging Detection Configuration'
01-Jul-2016 17:12:40 All post build plugins have finished
01-Jul-2016 17:12:40 Generating build results summary...
01-Jul-2016 17:12:40 Saving build results to disk...
01-Jul-2016 17:12:40 Logging substituted variables...
01-Jul-2016 17:12:40 Indexing build results...
01-Jul-2016 17:12:40 Finished building SNS-BU-JOB1-3.