Build: #44 failed Changes by Steven Blom

Logs

The following logs have been generated by the jobs in this plan.
  • Expand all
  • Collapse all
Job Logs
Collapse Default Job Default Stage Download or View
22-Jun-2017 02:32:35                 Quad quad = makeQuad(bq);
22-Jun-2017 02:32:35                             ^
22-Jun-2017 02:32:35   required: BakedQuad,ITextureContext
22-Jun-2017 02:32:35   found: BakedQuad
22-Jun-2017 02:32:35   reason: actual and formal argument lists differ in length
22-Jun-2017 02:32:35   where T is a type-variable:
22-Jun-2017 02:32:35     T extends ITextureType declared in class AbstractTexture
22-Jun-2017 02:32:39 Note: Some input files use unchecked or unsafe operations.
22-Jun-2017 02:32:39 Note: Recompile with -Xlint:unchecked for details.
22-Jun-2017 02:32:39 1 error
22-Jun-2017 02:32:39 :compileJava FAILED
22-Jun-2017 02:32:39
22-Jun-2017 02:32:39 FAILURE: Build failed with an exception.
22-Jun-2017 02:32:39
22-Jun-2017 02:32:39 * What went wrong:
22-Jun-2017 02:32:39
22-Jun-2017 02:32:39 BUILD FAILED
22-Jun-2017 02:32:39
22-Jun-2017 02:32:39 Execution failed for task ':compileJava'.
22-Jun-2017 02:32:39 > Compilation failed; see the compiler error output for details.
22-Jun-2017 02:32:39
22-Jun-2017 02:32:39 * Try:
22-Jun-2017 02:32:39 Run with --stacktrace option to get the stack trace. Run with --info or --debug option to get more log output.
22-Jun-2017 02:32:39 Total time: 52.496 secs
22-Jun-2017 02:32:40 Unable to publish artifact [Universal]: the source directory /var/atlassian/application-data/bamboo/xml-data/build-dir/TF-ONEELEVEN-JOB1/build/libs does not exist.