Build: #93 failed Changes by Drullkus Alphus

Build result summary

Details

Completed
Duration
45 seconds
Labels
None
Agent
Default Agent
Revision
3aa599f2028287492920c301946dd5bbd79d53d5 3aa599f2028287492920c301946dd5bbd79d53d5
Fixed in
#94 (Changes by Drullkus Alphus)

No failed tests found, a possible compilation error occurred.

Responsible

No one has taken responsibility for this failure

Code commits

Author Commit Message Commit date
Drullkus Alphus Drullkus Alphus 3aa599f2028287492920c301946dd5bbd79d53d5 3aa599f2028287492920c301946dd5bbd79d53d5 Update CTM

Error summary for Default Job

The job generated some errors, drill down into the full build log for more details.

/var/atlassian/application-data/bamboo/xml-data/build-dir/TF-ONEELEVEN-JOB1/build/sources/main/java/twilightforest/client/texture/render/TextureContextMCTM.java:17: error: constructor TextureContextCTM in class TextureContextCTM cannot be applied to given types;
                super(state, world, pos);
                ^
  required: IBlockState,IBlockAccess,BlockPos,TextureCTM
  found: IBlockState,IBlockAccess,BlockPos
  reason: actual and formal argument lists differ in length
/var/atlassian/application-data/bamboo/xml-data/build-dir/TF-ONEELEVEN-JOB1/build/sources/main/java/twilightforest/client/texture/render/TextureContextMCTM.java:21: error: constructor TextureContextCTM in class TextureContextCTM cannot be applied to given types;
                super(data);
                ^
  required: IBlockState,IBlockAccess,BlockPos,TextureCTM
  found: long
  reason: actual and formal argument lists differ in length
Note: /var/atlassian/application-data/bamboo/xml-data/build-dir/TF-ONEELEVEN-JOB1/build/sources/main/java/twilightforest/client/texture/render/TextureContextMCTM.java uses or overrides a deprecated API.
Note: Recompile with -Xlint:deprecation for details.
Note: Some input files use unchecked or unsafe operations.
Note: Recompile with -Xlint:unchecked for details.
2 errors

FAILURE: Build failed with an exception.

* What went wrong:
Execution failed for task ':compileJava'.
> Compilation failed; see the compiler error output for details.

* Try:
Run with --stacktrace option to get the stack trace. Run with --info or --debug option to get more log output.