Twilight Forest for 1.12.2

Build: #387 failed Changes by Tamaized

Build result summary

Details

Completed
Duration
46 seconds
Labels
None
Agent
Default Agent
Revision
19f0675efedb5578b1bf612edfc888e8aa523251 19f0675efedb5578b1bf612edfc888e8aa523251
Failing since
#384 (Changes by Drullkus Alphus)
Fixed in
#388 (Changes by Drullkus Alphus)

No failed tests found, a possible compilation error occurred.

Responsible

Code commits

Author Commit Message Commit date
Tamaized Tamaized 19f0675efedb5578b1bf612edfc888e8aa523251 19f0675efedb5578b1bf612edfc888e8aa523251 fixed #467

Error summary for Default Job

The job generated some errors, drill down into the full build log for more details.

/var/atlassian/application-data/bamboo/xml-data/build-dir/TF-ONETWELVE-JOB1/build/sources/main/java/twilightforest/compat/Thaumcraft.java:7: error: package thaumcraft.api does not exist
import thaumcraft.api.ThaumcraftApi;
                     ^
/var/atlassian/application-data/bamboo/xml-data/build-dir/TF-ONETWELVE-JOB1/build/sources/main/java/twilightforest/compat/Thaumcraft.java:8: error: package thaumcraft.api.aspects does not exist
import thaumcraft.api.aspects.Aspect;
                             ^
/var/atlassian/application-data/bamboo/xml-data/build-dir/TF-ONETWELVE-JOB1/build/sources/main/java/twilightforest/compat/Thaumcraft.java:9: error: package thaumcraft.api.aspects does not exist
import thaumcraft.api.aspects.AspectList;
                             ^
/var/atlassian/application-data/bamboo/xml-data/build-dir/TF-ONETWELVE-JOB1/build/sources/main/java/twilightforest/compat/Thaumcraft.java:145: error: cannot find symbol
    private static void registerTCObjectTag(Block block, int meta, AspectList list) {
                                                                   ^
  symbol:   class AspectList
  location: class Thaumcraft
/var/atlassian/application-data/bamboo/xml-data/build-dir/TF-ONETWELVE-JOB1/build/sources/main/java/twilightforest/compat/Thaumcraft.java:151: error: cannot find symbol
    private static void registerTCObjectTag(Item item, int meta, AspectList list) {
                                                                 ^
  symbol:   class AspectList
  location: class Thaumcraft
5 errors

FAILURE: Build failed with an exception.

* What went wrong:
Execution failed for task ':compileJava'.
> Compilation failed; see the compiler error output for details.

* Try:
Run with --stacktrace option to get the stack trace. Run with --info or --debug option to get more log output.

BUILD FAILED in 45s